Project Number Date
test_Tails_ISO_stable 6746 13 Oct 2026, 13:58

Feature Report

Steps Scenarios Features
Feature Passed Failed Skipped Pending Undefined Total Passed Failed Total Duration Status
Browsing the web using the Tor Browser 48 17 52 0 0 117 0 17 17 23:58.016 Failed
Tags: @product
Feature Browsing the web using the Tor Browser
As a Tails user when I browse the web using the Tor Browser all Internet traffic should flow only through Tor
Tags: @product
1:17.063
Scenario The Tor Browser cannot access the LAN
Before features/support/hooks.rb:274 0.000
Before features/support/hooks.rb:281 0.002
Steps
Given I have started Tails from DVD and logged in and the network is connected 9.315
And a web server is running on the LAN 1.021
And I capture all network traffic 0.001
When I start the Tor Browser 1:6.724
can
can not find any of the patterns ["TorBrowserAboutTor.png", "TorBrowser2025YECBanner.png", "TorBrowser2025YECBannerRTL.png"] on the screen (FindFailed)
./features/support/helpers/screen.rb:248:in `rescue in wait_any'
./features/support/helpers/screen.rb:232:in `wait_any'
./features/step_definitions/browser.rb:538:in `/^the Tor Browser loads about:tor$/'
./features/step_definitions/browser.rb:499:in `/^I start the Tor Browser( in offline mode)?$/'
features/torified_browsing.feature:11:in `When I start the Tor Browser'
And I open a page on the LAN web server in the Tor Browser 0.000
Then the Tor Browser shows the "Unable to connect" error 0.000
And no traffic was sent to the web server on the LAN 0.000
After features/support/hooks.rb:339 5.092

SCENARIO FAILED: 'The Tor Browser cannot access the LAN' (at time 03:44:10)

Boot log: https://jenkins.tails.net/job/test_Tails_ISO_stable/6746/artifact/build-artifacts/03:44:10_The_Tor_Browser_cannot_access_the_LAN.file_content_var_log_boot.log

Screenshot: https://jenkins.tails.net/job/test_Tails_ISO_stable/6746/artifact/build-artifacts/03:44:10_The_Tor_Browser_cannot_access_the_LAN.png

Video: https://jenkins.tails.net/job/test_Tails_ISO_stable/6746/artifact/build-artifacts/03:44:10_The_Tor_Browser_cannot_access_the_LAN.mkv

Systemd journal: https://jenkins.tails.net/job/test_Tails_ISO_stable/6746/artifact/build-artifacts/03:44:10_The_Tor_Browser_cannot_access_the_LAN.journal

After features/support/hooks.rb:108 0.051
1:31.336
Scenario The Downloads directory is usable in Tor Browser
Before features/support/hooks.rb:274 0.000
Before features/support/hooks.rb:281 0.002
Before features/support/hooks.rb:527 0.001
Steps
Given I have started Tails from DVD and logged in and the network is connected 9.283
Then the live user's Downloads directory exists 0.048
And there is a GNOME bookmark for the Downloads directory 15.299
When I start the Tor Browser 1:6.704
can
can not find any of the patterns ["TorBrowserAboutTor.png", "TorBrowser2025YECBanner.png", "TorBrowser2025YECBannerRTL.png"] on the screen (FindFailed)
./features/support/helpers/screen.rb:248:in `rescue in wait_any'
./features/support/helpers/screen.rb:232:in `wait_any'
./features/step_definitions/browser.rb:538:in `/^the Tor Browser loads about:tor$/'
./features/step_definitions/browser.rb:499:in `/^I start the Tor Browser( in offline mode)?$/'
features/torified_browsing.feature:21:in `When I start the Tor Browser'
Then I can save the current page as "index.html" to the Downloads directory 0.000
And I can print the current page as "output.pdf" to the Downloads directory 0.000
After features/support/hooks.rb:535 0.033
After features/support/hooks.rb:339 5.188

SCENARIO FAILED: 'The Downloads directory is usable in Tor Browser' (at time 03:45:47)

Boot log: https://jenkins.tails.net/job/test_Tails_ISO_stable/6746/artifact/build-artifacts/03:45:47_The_Downloads_directory_is_usable_in_Tor_Browser.file_content_var_log_boot.log

Screenshot: https://jenkins.tails.net/job/test_Tails_ISO_stable/6746/artifact/build-artifacts/03:45:47_The_Downloads_directory_is_usable_in_Tor_Browser.png

Video: https://jenkins.tails.net/job/test_Tails_ISO_stable/6746/artifact/build-artifacts/03:45:47_The_Downloads_directory_is_usable_in_Tor_Browser.mkv

Systemd journal: https://jenkins.tails.net/job/test_Tails_ISO_stable/6746/artifact/build-artifacts/03:45:47_The_Downloads_directory_is_usable_in_Tor_Browser.journal

After features/support/hooks.rb:108 0.000
1:15.857
Scenario Downloading files with the Tor Browser
Before features/support/hooks.rb:274 0.000
Before features/support/hooks.rb:281 0.002
Before features/support/hooks.rb:527 0.001
Steps
Given I have started Tails from DVD and logged in and the network is connected 9.241
When I start the Tor Browser 1:6.616
can
can not find any of the patterns ["TorBrowserAboutTor.png", "TorBrowser2025YECBanner.png", "TorBrowser2025YECBannerRTL.png"] on the screen (FindFailed)
./features/support/helpers/screen.rb:248:in `rescue in wait_any'
./features/support/helpers/screen.rb:232:in `wait_any'
./features/step_definitions/browser.rb:538:in `/^the Tor Browser loads about:tor$/'
./features/step_definitions/browser.rb:499:in `/^I start the Tor Browser( in offline mode)?$/'
features/torified_browsing.feature:28:in `When I start the Tor Browser'
When I download some file in the Tor Browser to the Downloads directory 0.000
Then the file is saved to the Downloads directory 0.000
After features/support/hooks.rb:535 0.032
After features/support/hooks.rb:339 5.212

SCENARIO FAILED: 'Downloading files with the Tor Browser' (at time 03:47:08)

Boot log: https://jenkins.tails.net/job/test_Tails_ISO_stable/6746/artifact/build-artifacts/03:47:08_Downloading_files_with_the_Tor_Browser.file_content_var_log_boot.log

Screenshot: https://jenkins.tails.net/job/test_Tails_ISO_stable/6746/artifact/build-artifacts/03:47:08_Downloading_files_with_the_Tor_Browser.png

Video: https://jenkins.tails.net/job/test_Tails_ISO_stable/6746/artifact/build-artifacts/03:47:08_Downloading_files_with_the_Tor_Browser.mkv

Systemd journal: https://jenkins.tails.net/job/test_Tails_ISO_stable/6746/artifact/build-artifacts/03:47:08_Downloading_files_with_the_Tor_Browser.journal

After features/support/hooks.rb:108 0.000
1:16.544
Scenario Playing an Ogg audio track
Before features/support/hooks.rb:274 0.000
Before features/support/hooks.rb:281 0.002
Before features/support/hooks.rb:527 0.001
Steps
Given I have started Tails from DVD and logged in and the network is connected 9.217
When I start the Tor Browser 1:7.327
can
can not find any of the patterns ["TorBrowserAboutTor.png", "TorBrowser2025YECBanner.png", "TorBrowser2025YECBannerRTL.png"] on the screen (FindFailed)
./features/support/helpers/screen.rb:248:in `rescue in wait_any'
./features/support/helpers/screen.rb:232:in `wait_any'
./features/step_definitions/browser.rb:538:in `/^the Tor Browser loads about:tor$/'
./features/step_definitions/browser.rb:499:in `/^I start the Tor Browser( in offline mode)?$/'
features/torified_browsing.feature:35:in `When I start the Tor Browser'
Then I can listen to an Ogg audio track in Tor Browser 0.000
After features/support/hooks.rb:535 0.039
After features/support/hooks.rb:339 5.012

SCENARIO FAILED: 'Playing an Ogg audio track' (at time 03:48:30)

Boot log: https://jenkins.tails.net/job/test_Tails_ISO_stable/6746/artifact/build-artifacts/03:48:30_Playing_an_Ogg_audio_track.file_content_var_log_boot.log

Screenshot: https://jenkins.tails.net/job/test_Tails_ISO_stable/6746/artifact/build-artifacts/03:48:30_Playing_an_Ogg_audio_track.png

Video: https://jenkins.tails.net/job/test_Tails_ISO_stable/6746/artifact/build-artifacts/03:48:30_Playing_an_Ogg_audio_track.mkv

Systemd journal: https://jenkins.tails.net/job/test_Tails_ISO_stable/6746/artifact/build-artifacts/03:48:30_Playing_an_Ogg_audio_track.journal

After features/support/hooks.rb:108 0.000
1:16.358
Scenario Watching a WebM video
Before features/support/hooks.rb:274 0.000
Before features/support/hooks.rb:281 0.002
Before features/support/hooks.rb:527 0.001
Steps
Given I have started Tails from DVD and logged in and the network is connected 9.165
When I start the Tor Browser 1:7.192
can
can not find any of the patterns ["TorBrowserAboutTor.png", "TorBrowser2025YECBanner.png", "TorBrowser2025YECBannerRTL.png"] on the screen (FindFailed)
./features/support/helpers/screen.rb:248:in `rescue in wait_any'
./features/support/helpers/screen.rb:232:in `wait_any'
./features/step_definitions/browser.rb:538:in `/^the Tor Browser loads about:tor$/'
./features/step_definitions/browser.rb:499:in `/^I start the Tor Browser( in offline mode)?$/'
features/torified_browsing.feature:41:in `When I start the Tor Browser'
Then I can watch a WebM video in Tor Browser 0.000
After features/support/hooks.rb:535 0.029
After features/support/hooks.rb:339 5.293

SCENARIO FAILED: 'Watching a WebM video' (at time 03:49:51)

Boot log: https://jenkins.tails.net/job/test_Tails_ISO_stable/6746/artifact/build-artifacts/03:49:51_Watching_a_WebM_video.file_content_var_log_boot.log

Screenshot: https://jenkins.tails.net/job/test_Tails_ISO_stable/6746/artifact/build-artifacts/03:49:51_Watching_a_WebM_video.png

Video: https://jenkins.tails.net/job/test_Tails_ISO_stable/6746/artifact/build-artifacts/03:49:51_Watching_a_WebM_video.mkv

Systemd journal: https://jenkins.tails.net/job/test_Tails_ISO_stable/6746/artifact/build-artifacts/03:49:51_Watching_a_WebM_video.journal

After features/support/hooks.rb:108 0.000
Tags: @product
1:16.471
Scenario I can view a file stored in "~/Downloads" but not in ~/.gnupg
Before features/support/hooks.rb:274 0.000
Before features/support/hooks.rb:281 0.002
Steps
Given I have started Tails from DVD and logged in and the network is connected 9.295
And I copy "/usr/share/synaptic/html/index.html" to "/home/amnesia/Downloads/synaptic.html" as user "amnesia" 0.078
And I copy "/usr/share/synaptic/html/index.html" to "/home/amnesia/.gnupg/synaptic.html" as user "amnesia" 0.041
And I copy "/usr/share/synaptic/html/index.html" to "/tmp/synaptic.html" as user "amnesia" 0.035
Then the file "/home/amnesia/.gnupg/synaptic.html" exists 0.046
And the file "/lib/live/mount/overlay/rw/home/amnesia/.gnupg/synaptic.html" exists 0.041
And the file "/live/overlay/rw/home/amnesia/.gnupg/synaptic.html" exists 0.041
And the file "/tmp/synaptic.html" exists 0.034
Given I start monitoring the AppArmor log of "torbrowser_firefox" 0.104
When I start the Tor Browser 1:6.752
can
can not find any of the patterns ["TorBrowserAboutTor.png", "TorBrowser2025YECBanner.png", "TorBrowser2025YECBannerRTL.png"] on the screen (FindFailed)
./features/support/helpers/screen.rb:248:in `rescue in wait_any'
./features/support/helpers/screen.rb:232:in `wait_any'
./features/step_definitions/browser.rb:538:in `/^the Tor Browser loads about:tor$/'
./features/step_definitions/browser.rb:499:in `/^I start the Tor Browser( in offline mode)?$/'
features/torified_browsing.feature:54:in `When I start the Tor Browser'
And I open the address "file:///home/amnesia/Downloads/synaptic.html" in the Tor Browser 0.000
Then I see "TorBrowserSynapticManual.png" after at most 5 seconds 0.000
And AppArmor has not denied "torbrowser_firefox" from opening "/home/amnesia/Downloads/synaptic.html" 0.000
When I open the address "file:///home/amnesia/.gnupg/synaptic.html" in the Tor Browser 0.000
Then I do not see "TorBrowserSynapticManual.png" after at most 5 seconds 0.000
When I open the address "file:///lib/live/mount/overlay/rw/home/amnesia/.gnupg/synaptic.html" in the Tor Browser 0.000
Then I do not see "TorBrowserSynapticManual.png" after at most 5 seconds 0.000
When I open the address "file:///live/overlay/rw/home/amnesia/.gnupg/synaptic.html" in the Tor Browser 0.000
Then I do not see "TorBrowserSynapticManual.png" after at most 5 seconds 0.000
When I open the address "file:///tmp/synaptic.html" in the Tor Browser 0.000
Then I do not see "TorBrowserSynapticManual.png" after at most 5 seconds 0.000
After features/support/hooks.rb:339 5.142

SCENARIO FAILED: 'I can view a file stored in "~/Downloads" but not in ~/.gnupg' (at time 03:51:13)

Boot log: https://jenkins.tails.net/job/test_Tails_ISO_stable/6746/artifact/build-artifacts/03:51:13_I_can_view_a_file_stored_in____Downloads__but_not_in___.gnupg.file_content_var_log_boot.log

Screenshot: https://jenkins.tails.net/job/test_Tails_ISO_stable/6746/artifact/build-artifacts/03:51:13_I_can_view_a_file_stored_in____Downloads__but_not_in___.gnupg.png

Video: https://jenkins.tails.net/job/test_Tails_ISO_stable/6746/artifact/build-artifacts/03:51:13_I_can_view_a_file_stored_in____Downloads__but_not_in___.gnupg.mkv

Systemd journal: https://jenkins.tails.net/job/test_Tails_ISO_stable/6746/artifact/build-artifacts/03:51:13_I_can_view_a_file_stored_in____Downloads__but_not_in___.gnupg.journal

After features/support/hooks.rb:108 0.000
Tags: @product
1:16.132
Scenario The Tor Browser uses TBB's shared libraries
Before features/support/hooks.rb:274 0.000
Before features/support/hooks.rb:281 0.002
Steps
Given I have started Tails from DVD and logged in and the network is connected 9.413
When I start the Tor Browser 1:6.718
can
can not find any of the patterns ["TorBrowserAboutTor.png", "TorBrowser2025YECBanner.png", "TorBrowser2025YECBannerRTL.png"] on the screen (FindFailed)
./features/support/helpers/screen.rb:248:in `rescue in wait_any'
./features/support/helpers/screen.rb:232:in `wait_any'
./features/step_definitions/browser.rb:538:in `/^the Tor Browser loads about:tor$/'
./features/step_definitions/browser.rb:499:in `/^I start the Tor Browser( in offline mode)?$/'
features/torified_browsing.feature:69:in `When I start the Tor Browser'
Then the Tor Browser uses all expected TBB shared libraries 0.000
After features/support/hooks.rb:339 5.008

SCENARIO FAILED: 'The Tor Browser uses TBB's shared libraries' (at time 03:52:34)

Boot log: https://jenkins.tails.net/job/test_Tails_ISO_stable/6746/artifact/build-artifacts/03:52:34_The_Tor_Browser_uses_TBB_s_shared_libraries.file_content_var_log_boot.log

Screenshot: https://jenkins.tails.net/job/test_Tails_ISO_stable/6746/artifact/build-artifacts/03:52:34_The_Tor_Browser_uses_TBB_s_shared_libraries.png

Video: https://jenkins.tails.net/job/test_Tails_ISO_stable/6746/artifact/build-artifacts/03:52:34_The_Tor_Browser_uses_TBB_s_shared_libraries.mkv

Systemd journal: https://jenkins.tails.net/job/test_Tails_ISO_stable/6746/artifact/build-artifacts/03:52:34_The_Tor_Browser_uses_TBB_s_shared_libraries.journal

After features/support/hooks.rb:108 0.000
1:15.953
Scenario The Tor Browser's "New identity" feature works as expected
Before features/support/hooks.rb:274 0.000
Before features/support/hooks.rb:281 0.002
Before features/support/hooks.rb:527 0.002
Steps
Given I have started Tails from DVD and logged in and the network is connected 9.454
When I start the Tor Browser 1:6.499
can
can not find any of the patterns ["TorBrowserAboutTor.png", "TorBrowser2025YECBanner.png", "TorBrowser2025YECBannerRTL.png"] on the screen (FindFailed)
./features/support/helpers/screen.rb:248:in `rescue in wait_any'
./features/support/helpers/screen.rb:232:in `wait_any'
./features/step_definitions/browser.rb:538:in `/^the Tor Browser loads about:tor$/'
./features/step_definitions/browser.rb:499:in `/^I start the Tor Browser( in offline mode)?$/'
features/torified_browsing.feature:75:in `When I start the Tor Browser'
And I open the Tails homepage in the Tor Browser 0.000
Then the Tor Browser loads the Tails homepage 0.000
And the Tor Browser has 2 tabs open 0.000
When I request a new identity in Tor Browser 0.000
Then the Tor Browser loads about:tor 0.000
And the Tor Browser has 1 tab open 0.000
After features/support/hooks.rb:535 0.035
After features/support/hooks.rb:339 5.107

SCENARIO FAILED: 'The Tor Browser's "New identity" feature works as expected' (at time 03:53:55)

Boot log: https://jenkins.tails.net/job/test_Tails_ISO_stable/6746/artifact/build-artifacts/03:53:55_The_Tor_Browser_s__New_identity__feature_works_as_expected.file_content_var_log_boot.log

Screenshot: https://jenkins.tails.net/job/test_Tails_ISO_stable/6746/artifact/build-artifacts/03:53:55_The_Tor_Browser_s__New_identity__feature_works_as_expected.png

Video: https://jenkins.tails.net/job/test_Tails_ISO_stable/6746/artifact/build-artifacts/03:53:55_The_Tor_Browser_s__New_identity__feature_works_as_expected.mkv

Systemd journal: https://jenkins.tails.net/job/test_Tails_ISO_stable/6746/artifact/build-artifacts/03:53:55_The_Tor_Browser_s__New_identity__feature_works_as_expected.journal

After features/support/hooks.rb:108 0.000
Tags: @product
1:15.814
Scenario The Tor Browser's circuit view feature works as expected
Before features/support/hooks.rb:274 0.000
Before features/support/hooks.rb:281 0.002
Steps
Given I have started Tails from DVD and logged in and the network is connected 9.271
When I start the Tor Browser 1:6.542
can
can not find any of the patterns ["TorBrowserAboutTor.png", "TorBrowser2025YECBanner.png", "TorBrowser2025YECBannerRTL.png"] on the screen (FindFailed)
./features/support/helpers/screen.rb:248:in `rescue in wait_any'
./features/support/helpers/screen.rb:232:in `wait_any'
./features/step_definitions/browser.rb:538:in `/^the Tor Browser loads about:tor$/'
./features/step_definitions/browser.rb:499:in `/^I start the Tor Browser( in offline mode)?$/'
features/torified_browsing.feature:88:in `When I start the Tor Browser'
And I open the Tails homepage in the Tor Browser 0.000
Then the Tor Browser loads the Tails homepage 0.000
And Tor Browser's circuit view is working 0.000
After features/support/hooks.rb:339 5.330

SCENARIO FAILED: 'The Tor Browser's circuit view feature works as expected' (at time 03:55:16)

Boot log: https://jenkins.tails.net/job/test_Tails_ISO_stable/6746/artifact/build-artifacts/03:55:16_The_Tor_Browser_s_circuit_view_feature_works_as_expected.file_content_var_log_boot.log

Screenshot: https://jenkins.tails.net/job/test_Tails_ISO_stable/6746/artifact/build-artifacts/03:55:16_The_Tor_Browser_s_circuit_view_feature_works_as_expected.png

Video: https://jenkins.tails.net/job/test_Tails_ISO_stable/6746/artifact/build-artifacts/03:55:16_The_Tor_Browser_s_circuit_view_feature_works_as_expected.mkv

Systemd journal: https://jenkins.tails.net/job/test_Tails_ISO_stable/6746/artifact/build-artifacts/03:55:16_The_Tor_Browser_s_circuit_view_feature_works_as_expected.journal

After features/support/hooks.rb:108 0.000
Tags: @product
1:15.881
Scenario WebRTC is disabled in Tor Browser
Before features/support/hooks.rb:274 0.000
Before features/support/hooks.rb:281 0.002
Steps
Given I have started Tails from DVD and logged in and the network is connected 9.304
When I start the Tor Browser 1:6.577
can
can not find any of the patterns ["TorBrowserAboutTor.png", "TorBrowser2025YECBanner.png", "TorBrowser2025YECBannerRTL.png"] on the screen (FindFailed)
./features/support/helpers/screen.rb:248:in `rescue in wait_any'
./features/support/helpers/screen.rb:232:in `wait_any'
./features/step_definitions/browser.rb:538:in `/^the Tor Browser loads about:tor$/'
./features/step_definitions/browser.rb:499:in `/^I start the Tor Browser( in offline mode)?$/'
features/torified_browsing.feature:95:in `When I start the Tor Browser'
When I open the address "https://net.ipcalf.com/" in the Tor Browser 0.000
Then Tor Browser displays a 'ifconfig | grep inet | grep -v inet6 | cut -d" " -f2 | tail -n1' heading on the "Network IP Address via ipcalf.com" page 0.000
When I open the address "https://mozilla.github.io/webrtc-landing/pc_test.html" in the Tor Browser 0.000
Then Tor Browser displays a "RTCPeerConnection is missing!" heading on the "Simple RTCPeerConnection Video Test" page 0.000
After features/support/hooks.rb:339 5.328

SCENARIO FAILED: 'WebRTC is disabled in Tor Browser' (at time 03:56:38)

Boot log: https://jenkins.tails.net/job/test_Tails_ISO_stable/6746/artifact/build-artifacts/03:56:38_WebRTC_is_disabled_in_Tor_Browser.file_content_var_log_boot.log

Screenshot: https://jenkins.tails.net/job/test_Tails_ISO_stable/6746/artifact/build-artifacts/03:56:38_WebRTC_is_disabled_in_Tor_Browser.png

Video: https://jenkins.tails.net/job/test_Tails_ISO_stable/6746/artifact/build-artifacts/03:56:38_WebRTC_is_disabled_in_Tor_Browser.mkv

Systemd journal: https://jenkins.tails.net/job/test_Tails_ISO_stable/6746/artifact/build-artifacts/03:56:38_WebRTC_is_disabled_in_Tor_Browser.journal

After features/support/hooks.rb:108 0.000
Tags: @product
1:46.828
Scenario The Persistent directory is usable in Tor Browser
Before features/support/hooks.rb:274 0.000
Before features/support/hooks.rb:281 0.002
Steps
Given I have started Tails without network from a USB drive with a persistent partition enabled and logged in 8.116
And the network is plugged 0.033
And I successfully configure Tor 8.156
And available upgrades have been checked 1.119
And all notifications have disappeared 6.723
And there is a GNOME bookmark for the Persistent directory 13.705
When I start the Tor Browser 1:8.973
can
can not find any of the patterns ["TorBrowserAboutTor.png", "TorBrowser2025YECBanner.png", "TorBrowser2025YECBannerRTL.png"] on the screen (FindFailed)
./features/support/helpers/screen.rb:248:in `rescue in wait_any'
./features/support/helpers/screen.rb:232:in `wait_any'
./features/step_definitions/browser.rb:538:in `/^the Tor Browser loads about:tor$/'
./features/step_definitions/browser.rb:499:in `/^I start the Tor Browser( in offline mode)?$/'
features/torified_browsing.feature:108:in `When I start the Tor Browser'
And I download some file in the Tor Browser to the Persistent directory 0.000
Then the file is saved to the Persistent directory 0.000
When I open the address "https://tails.net/about" in the Tor Browser 0.000
Then "Tails - How Tails works" has loaded in the Tor Browser 0.000
And I can print the current page as "output.pdf" to the Persistent directory 0.000
After features/support/hooks.rb:339 5.333

SCENARIO FAILED: 'The Persistent directory is usable in Tor Browser' (at time 03:58:30)

Boot log: https://jenkins.tails.net/job/test_Tails_ISO_stable/6746/artifact/build-artifacts/03:58:30_The_Persistent_directory_is_usable_in_Tor_Browser.file_content_var_log_boot.log

Screenshot: https://jenkins.tails.net/job/test_Tails_ISO_stable/6746/artifact/build-artifacts/03:58:30_The_Persistent_directory_is_usable_in_Tor_Browser.png

Video: https://jenkins.tails.net/job/test_Tails_ISO_stable/6746/artifact/build-artifacts/03:58:30_The_Persistent_directory_is_usable_in_Tor_Browser.mkv

Systemd journal: https://jenkins.tails.net/job/test_Tails_ISO_stable/6746/artifact/build-artifacts/03:58:30_The_Persistent_directory_is_usable_in_Tor_Browser.journal

After features/support/hooks.rb:108 0.000
Tags: @product
1:30.473
Scenario Outline The default XDG directories are usable in Tor Browser
Before features/support/hooks.rb:274 0.000
Before features/support/hooks.rb:281 0.002
Steps
Given I have started Tails from DVD without network and logged in 6.171
Then the live user's Documents directory exists 0.068
And there is a GNOME bookmark for the Documents directory 14.913
Then I start the Tor Browser in offline mode 1:9.320
can
can not find any of the patterns ["TorBrowserAboutTor.png", "TorBrowser2025YECBanner.png", "TorBrowser2025YECBannerRTL.png"] on the screen (FindFailed)
./features/support/helpers/screen.rb:248:in `rescue in wait_any'
./features/support/helpers/screen.rb:232:in `wait_any'
./features/step_definitions/browser.rb:538:in `/^the Tor Browser loads about:tor$/'
./features/step_definitions/browser.rb:499:in `/^I start the Tor Browser( in offline mode)?$/'
features/torified_browsing.feature:123:in `Then I start the Tor Browser in offline mode'
features/torified_browsing.feature:119:in `Then I start the Tor Browser in offline mode'
And I can save the current page as "index.html" to the Documents GNOME bookmark 0.000
After features/support/hooks.rb:339 5.097

SCENARIO FAILED: 'The default XDG directories are usable in Tor Browser, Examples (#1)' (at time 04:00:05)

Boot log: https://jenkins.tails.net/job/test_Tails_ISO_stable/6746/artifact/build-artifacts/04:00:05_The_default_XDG_directories_are_usable_in_Tor_Browser,_Examples___1_.file_content_var_log_boot.log

Screenshot: https://jenkins.tails.net/job/test_Tails_ISO_stable/6746/artifact/build-artifacts/04:00:05_The_default_XDG_directories_are_usable_in_Tor_Browser,_Examples___1_.png

Video: https://jenkins.tails.net/job/test_Tails_ISO_stable/6746/artifact/build-artifacts/04:00:05_The_default_XDG_directories_are_usable_in_Tor_Browser,_Examples___1_.mkv

Systemd journal: https://jenkins.tails.net/job/test_Tails_ISO_stable/6746/artifact/build-artifacts/04:00:05_The_default_XDG_directories_are_usable_in_Tor_Browser,_Examples___1_.journal

After features/support/hooks.rb:108 0.000
Tags: @product
1:33.788
Scenario Outline The default XDG directories are usable in Tor Browser
Before features/support/hooks.rb:274 0.000
Before features/support/hooks.rb:281 0.002
Steps
Given I have started Tails from DVD without network and logged in 6.278
Then the live user's Downloads directory exists 0.051
And there is a GNOME bookmark for the Downloads directory 17.658
Then I start the Tor Browser in offline mode 1:9.800
can
can not find any of the patterns ["TorBrowserAboutTor.png", "TorBrowser2025YECBanner.png", "TorBrowser2025YECBannerRTL.png"] on the screen (FindFailed)
./features/support/helpers/screen.rb:248:in `rescue in wait_any'
./features/support/helpers/screen.rb:232:in `wait_any'
./features/step_definitions/browser.rb:538:in `/^the Tor Browser loads about:tor$/'
./features/step_definitions/browser.rb:499:in `/^I start the Tor Browser( in offline mode)?$/'
features/torified_browsing.feature:124:in `Then I start the Tor Browser in offline mode'
features/torified_browsing.feature:119:in `Then I start the Tor Browser in offline mode'
And I can save the current page as "index.html" to the Downloads GNOME bookmark 0.000
After features/support/hooks.rb:339 5.353

SCENARIO FAILED: 'The default XDG directories are usable in Tor Browser, Examples (#2)' (at time 04:01:45)

Boot log: https://jenkins.tails.net/job/test_Tails_ISO_stable/6746/artifact/build-artifacts/04:01:45_The_default_XDG_directories_are_usable_in_Tor_Browser,_Examples___2_.file_content_var_log_boot.log

Screenshot: https://jenkins.tails.net/job/test_Tails_ISO_stable/6746/artifact/build-artifacts/04:01:45_The_default_XDG_directories_are_usable_in_Tor_Browser,_Examples___2_.png

Video: https://jenkins.tails.net/job/test_Tails_ISO_stable/6746/artifact/build-artifacts/04:01:45_The_default_XDG_directories_are_usable_in_Tor_Browser,_Examples___2_.mkv

Systemd journal: https://jenkins.tails.net/job/test_Tails_ISO_stable/6746/artifact/build-artifacts/04:01:45_The_default_XDG_directories_are_usable_in_Tor_Browser,_Examples___2_.journal

After features/support/hooks.rb:108 0.000
Tags: @product
1:33.119
Scenario Outline The default XDG directories are usable in Tor Browser
Before features/support/hooks.rb:274 0.000
Before features/support/hooks.rb:281 0.002
Steps
Given I have started Tails from DVD without network and logged in 6.255
Then the live user's Music directory exists 0.034
And there is a GNOME bookmark for the Music directory 17.599
Then I start the Tor Browser in offline mode 1:9.230
can
can not find any of the patterns ["TorBrowserAboutTor.png", "TorBrowser2025YECBanner.png", "TorBrowser2025YECBannerRTL.png"] on the screen (FindFailed)
./features/support/helpers/screen.rb:248:in `rescue in wait_any'
./features/support/helpers/screen.rb:232:in `wait_any'
./features/step_definitions/browser.rb:538:in `/^the Tor Browser loads about:tor$/'
./features/step_definitions/browser.rb:499:in `/^I start the Tor Browser( in offline mode)?$/'
features/torified_browsing.feature:125:in `Then I start the Tor Browser in offline mode'
features/torified_browsing.feature:119:in `Then I start the Tor Browser in offline mode'
And I can save the current page as "index.html" to the Music GNOME bookmark 0.000
After features/support/hooks.rb:339 4.855

SCENARIO FAILED: 'The default XDG directories are usable in Tor Browser, Examples (#3)' (at time 04:03:23)

Boot log: https://jenkins.tails.net/job/test_Tails_ISO_stable/6746/artifact/build-artifacts/04:03:23_The_default_XDG_directories_are_usable_in_Tor_Browser,_Examples___3_.file_content_var_log_boot.log

Screenshot: https://jenkins.tails.net/job/test_Tails_ISO_stable/6746/artifact/build-artifacts/04:03:23_The_default_XDG_directories_are_usable_in_Tor_Browser,_Examples___3_.png

Video: https://jenkins.tails.net/job/test_Tails_ISO_stable/6746/artifact/build-artifacts/04:03:23_The_default_XDG_directories_are_usable_in_Tor_Browser,_Examples___3_.mkv

Systemd journal: https://jenkins.tails.net/job/test_Tails_ISO_stable/6746/artifact/build-artifacts/04:03:23_The_default_XDG_directories_are_usable_in_Tor_Browser,_Examples___3_.journal

After features/support/hooks.rb:108 0.000
Tags: @product
1:33.190
Scenario Outline The default XDG directories are usable in Tor Browser
Before features/support/hooks.rb:274 0.000
Before features/support/hooks.rb:281 0.002
Steps
Given I have started Tails from DVD without network and logged in 6.277
Then the live user's Pictures directory exists 0.039
And there is a GNOME bookmark for the Pictures directory 17.697
Then I start the Tor Browser in offline mode 1:9.176
can
can not find any of the patterns ["TorBrowserAboutTor.png", "TorBrowser2025YECBanner.png", "TorBrowser2025YECBannerRTL.png"] on the screen (FindFailed)
./features/support/helpers/screen.rb:248:in `rescue in wait_any'
./features/support/helpers/screen.rb:232:in `wait_any'
./features/step_definitions/browser.rb:538:in `/^the Tor Browser loads about:tor$/'
./features/step_definitions/browser.rb:499:in `/^I start the Tor Browser( in offline mode)?$/'
features/torified_browsing.feature:126:in `Then I start the Tor Browser in offline mode'
features/torified_browsing.feature:119:in `Then I start the Tor Browser in offline mode'
And I can save the current page as "index.html" to the Pictures GNOME bookmark 0.000
After features/support/hooks.rb:339 4.887

SCENARIO FAILED: 'The default XDG directories are usable in Tor Browser, Examples (#4)' (at time 04:05:01)

Boot log: https://jenkins.tails.net/job/test_Tails_ISO_stable/6746/artifact/build-artifacts/04:05:01_The_default_XDG_directories_are_usable_in_Tor_Browser,_Examples___4_.file_content_var_log_boot.log

Screenshot: https://jenkins.tails.net/job/test_Tails_ISO_stable/6746/artifact/build-artifacts/04:05:01_The_default_XDG_directories_are_usable_in_Tor_Browser,_Examples___4_.png

Video: https://jenkins.tails.net/job/test_Tails_ISO_stable/6746/artifact/build-artifacts/04:05:01_The_default_XDG_directories_are_usable_in_Tor_Browser,_Examples___4_.mkv

Systemd journal: https://jenkins.tails.net/job/test_Tails_ISO_stable/6746/artifact/build-artifacts/04:05:01_The_default_XDG_directories_are_usable_in_Tor_Browser,_Examples___4_.journal

After features/support/hooks.rb:108 0.000
Tags: @product
1:33.221
Scenario Outline The default XDG directories are usable in Tor Browser
Before features/support/hooks.rb:274 0.000
Before features/support/hooks.rb:281 0.002
Steps
Given I have started Tails from DVD without network and logged in 6.211
Then the live user's Videos directory exists 0.041
And there is a GNOME bookmark for the Videos directory 17.801
Then I start the Tor Browser in offline mode 1:9.167
can
can not find any of the patterns ["TorBrowserAboutTor.png", "TorBrowser2025YECBanner.png", "TorBrowser2025YECBannerRTL.png"] on the screen (FindFailed)
./features/support/helpers/screen.rb:248:in `rescue in wait_any'
./features/support/helpers/screen.rb:232:in `wait_any'
./features/step_definitions/browser.rb:538:in `/^the Tor Browser loads about:tor$/'
./features/step_definitions/browser.rb:499:in `/^I start the Tor Browser( in offline mode)?$/'
features/torified_browsing.feature:127:in `Then I start the Tor Browser in offline mode'
features/torified_browsing.feature:119:in `Then I start the Tor Browser in offline mode'
And I can save the current page as "index.html" to the Videos GNOME bookmark 0.000
After features/support/hooks.rb:339 4.933

SCENARIO FAILED: 'The default XDG directories are usable in Tor Browser, Examples (#5)' (at time 04:06:39)

Boot log: https://jenkins.tails.net/job/test_Tails_ISO_stable/6746/artifact/build-artifacts/04:06:39_The_default_XDG_directories_are_usable_in_Tor_Browser,_Examples___5_.file_content_var_log_boot.log

Screenshot: https://jenkins.tails.net/job/test_Tails_ISO_stable/6746/artifact/build-artifacts/04:06:39_The_default_XDG_directories_are_usable_in_Tor_Browser,_Examples___5_.png

Video: https://jenkins.tails.net/job/test_Tails_ISO_stable/6746/artifact/build-artifacts/04:06:39_The_default_XDG_directories_are_usable_in_Tor_Browser,_Examples___5_.mkv

Systemd journal: https://jenkins.tails.net/job/test_Tails_ISO_stable/6746/artifact/build-artifacts/04:06:39_The_default_XDG_directories_are_usable_in_Tor_Browser,_Examples___5_.journal

After features/support/hooks.rb:108 0.000
Tags: @product
1:29.981
Scenario Persistent browser bookmarks
Before features/support/hooks.rb:274 0.000
Before features/support/hooks.rb:281 0.002
Steps
Given I have started Tails without network from a USB drive with a persistent partition enabled and logged in 7.614
And all tps features are active 7.604
And all persistent filesystems have safe access rights 0.140
And all persistence configuration files have safe access rights 0.220
And all persistent directories have safe access rights 1.539
When I start the Tor Browser in offline mode 1:12.860
can
can not find any of the patterns ["TorBrowserAboutTor.png", "TorBrowser2025YECBanner.png", "TorBrowser2025YECBannerRTL.png"] on the screen (FindFailed)
./features/support/helpers/screen.rb:248:in `rescue in wait_any'
./features/support/helpers/screen.rb:232:in `wait_any'
./features/step_definitions/browser.rb:538:in `/^the Tor Browser loads about:tor$/'
./features/step_definitions/browser.rb:499:in `/^I start the Tor Browser( in offline mode)?$/'
features/torified_browsing.feature:135:in `When I start the Tor Browser in offline mode'
And I add a bookmark to eff.org in the Tor Browser 0.000
And I cold reboot the computer 0.000
And the computer reboots Tails 0.000
And I enable persistence 0.000
And I log in to a new session 0.000
And all notifications have disappeared 0.000
And I start the Tor Browser in offline mode 0.000
Then the Tor Browser has a bookmark to eff.org 0.000
After features/support/hooks.rb:339 5.042

SCENARIO FAILED: 'Persistent browser bookmarks' (at time 04:08:14)

Boot log: https://jenkins.tails.net/job/test_Tails_ISO_stable/6746/artifact/build-artifacts/04:08:14_Persistent_browser_bookmarks.file_content_var_log_boot.log

Screenshot: https://jenkins.tails.net/job/test_Tails_ISO_stable/6746/artifact/build-artifacts/04:08:14_Persistent_browser_bookmarks.png

Video: https://jenkins.tails.net/job/test_Tails_ISO_stable/6746/artifact/build-artifacts/04:08:14_Persistent_browser_bookmarks.mkv

Systemd journal: https://jenkins.tails.net/job/test_Tails_ISO_stable/6746/artifact/build-artifacts/04:08:14_Persistent_browser_bookmarks.journal

After features/support/hooks.rb:108 0.000