Project Number Date
test_Tails_ISO_stable 6692 25 Sep 2026, 12:12

Feature Report

Steps Scenarios Features
Feature Passed Failed Skipped Pending Undefined Total Passed Failed Total Duration Status
Additional software 30 3 50 0 0 83 3 3 6 19:30.586 Failed
Feature Additional software
As a Tails user I may want to install software not shipped in Tails And have them installed automatically when I enable persistence in the Greeter
1:40.831
Before features/support/hooks.rb:274 0.000
Before features/support/hooks.rb:281 0.002
Before features/support/hooks.rb:527 0.002
Given I have started Tails from DVD and logged in with an administration password and the network is connected 1:19.253
And I update the APT lists using apt 6.517
When I install "popularity-contest" using apt 3.177
Then I am notified I can not use Additional Software for "popularity-contest" 3.096
And I can open the Additional Software documentation from the notification 8.785
After features/support/hooks.rb:535 0.698
After features/support/hooks.rb:339 1.260
After features/support/hooks.rb:108 0.003
2:34.186
Before features/support/hooks.rb:274 0.000
Before features/support/hooks.rb:281 0.002
Before features/support/hooks.rb:527 0.001
Given I start Tails from a freshly installed USB drive with an administration password and the network is plugged and I login 46.496
And I update the APT lists using apt 6.325
And I install "popularity-contest" using apt 3.196
Then I am proposed to add the "popularity-contest" package to my Additional Software 3.637
When I create a persistent storage and activate the Additional Software feature 16.015
Then Additional Software is correctly configured for package "popularity-contest" 1.760
When I shutdown Tails and wait for the computer to power off 4.080
And I start Tails from USB drive "__internal" with network unplugged 34.280
And I enable persistence 18.725
And I log in to a new session 7.214
And the Additional Software installation service has started 10.133
Then I am notified that the installation succeeded 1.655
And Additional Software is correctly configured for package "popularity-contest" 0.560
And the package "popularity-contest" is installed after Additional Software has been installed 0.105
After features/support/hooks.rb:535 0.715
After features/support/hooks.rb:339 0.842
After features/support/hooks.rb:108 0.010
1:17.129
Before features/support/hooks.rb:274 0.000
Before features/support/hooks.rb:281 0.001
Before features/support/hooks.rb:527 0.001
Given a computer 0.081
And I start Tails from USB drive "__internal" and I login with an administration password 1:4.304
And I update the APT lists using apt 5.366
When I install "ripgrep" using apt 3.148
Then the Additional Software dpkg hook has been run for package "ripgrep" and notices the persistence is locked 4.187
And the package "ripgrep" is installed 0.041
After features/support/hooks.rb:535 0.742
After features/support/hooks.rb:339 0.826
After features/support/hooks.rb:108 0.010
6:38.090
Scenario My Additional Software list is configurable through a GUI or through notifications when I install or remove packages with APT or Synaptic
Before features/support/hooks.rb:274 0.000
Before features/support/hooks.rb:281 0.010
Before features/support/hooks.rb:527 0.002
Steps
Given a computer 0.108
And I start Tails from USB drive "__internal" and I login with persistence enabled and an administration password 6:37.982
try_for() timeout expired (Timeout::Error)
./features/support/helpers/misc_helpers.rb:145:in `rescue in try_for'
./features/support/helpers/misc_helpers.rb:51:in `try_for'
./features/step_definitions/common_steps.rb:764:in `/^available upgrades have been checked$/'
./features/step_definitions/common_steps.rb:259:in `/^I start Tails from (.+?) drive "(.+?)"( with network unplugged)?( and I login( with persistence enabled)?( with the changed persistence passphrase)?( (?:and|with) an administration password)?)?$/'
features/additional_software_packages.feature:55:in `And I start Tails from USB drive "__internal" and I login with persistence enabled and an administration password'
When I uninstall "popularity-contest" using apt 0.000
And I accept removing "popularity-contest" from Additional Software 0.000
Then "popularity-contest" is not in the list of Additional Software 0.000
When I start Synaptic 0.000
And I update the APT lists using Synaptic 0.000
And I install "cowsay" using Synaptic 0.000
And I accept adding "cowsay" to Additional Software 0.000
Then Additional Software is correctly configured for package "cowsay" 0.000
When I uninstall "cowsay" using apt 0.000
And I refuse removing "cowsay" from Additional Software 0.000
Then Additional Software is correctly configured for package "cowsay" 0.000
When I start "Additional Software" via GNOME Activities Overview 0.000
And I remove "cowsay" from the list of Additional Software using Additional Software GUI 0.000
Then "cowsay" is not in the list of Additional Software 0.000
When I install "cowsay" using apt 0.000
And I refuse adding "cowsay" to Additional Software 0.000
Then "cowsay" is not in the list of Additional Software 0.000
After features/support/hooks.rb:535 0.030
After features/support/hooks.rb:339 5.098

SCENARIO FAILED: 'My Additional Software list is configurable through a GUI or through notifications when I install or remove packages with APT or Synaptic' (at time 01:20:17)

Boot log: https://jenkins.tails.net/job/test_Tails_ISO_stable/6692/artifact/build-artifacts/01:20:17_My_Additional_Software_list_is_configurable_through_a_GUI_or_through_notifications_when_I_install_or_remove_packages_with_APT_or_Synaptic.file_content_var_log_boot.log

Content of /run/live-additional-software/log: https://jenkins.tails.net/job/test_Tails_ISO_stable/6692/artifact/build-artifacts/01:20:17_My_Additional_Software_list_is_configurable_through_a_GUI_or_through_notifications_when_I_install_or_remove_packages_with_APT_or_Synaptic.file_content_run_live-additional-software_log

Output of ls -la --full-time /live/persistence/tailsdata_unlocked: https://jenkins.tails.net/job/test_Tails_ISO_stable/6692/artifact/build-artifacts/01:20:17_My_Additional_Software_list_is_configurable_through_a_GUI_or_through_notifications_when_I_install_or_remove_packages_with_APT_or_Synaptic.cmd_output_persistent_volume

Output of ls -lar --full-time /var/cache/apt: https://jenkins.tails.net/job/test_Tails_ISO_stable/6692/artifact/build-artifacts/01:20:17_My_Additional_Software_list_is_configurable_through_a_GUI_or_through_notifications_when_I_install_or_remove_packages_with_APT_or_Synaptic.cmd_output_var_cache_apt

Output of ls -lar --full-time /var/lib/apt: https://jenkins.tails.net/job/test_Tails_ISO_stable/6692/artifact/build-artifacts/01:20:17_My_Additional_Software_list_is_configurable_through_a_GUI_or_through_notifications_when_I_install_or_remove_packages_with_APT_or_Synaptic.cmd_output_var_lib_apt

Output of mount: https://jenkins.tails.net/job/test_Tails_ISO_stable/6692/artifact/build-artifacts/01:20:17_My_Additional_Software_list_is_configurable_through_a_GUI_or_through_notifications_when_I_install_or_remove_packages_with_APT_or_Synaptic.cmd_output_mount

Screenshot: https://jenkins.tails.net/job/test_Tails_ISO_stable/6692/artifact/build-artifacts/01:20:17_My_Additional_Software_list_is_configurable_through_a_GUI_or_through_notifications_when_I_install_or_remove_packages_with_APT_or_Synaptic.png

Video: https://jenkins.tails.net/job/test_Tails_ISO_stable/6692/artifact/build-artifacts/01:20:17_My_Additional_Software_list_is_configurable_through_a_GUI_or_through_notifications_when_I_install_or_remove_packages_with_APT_or_Synaptic.mkv

Systemd journal: https://jenkins.tails.net/job/test_Tails_ISO_stable/6692/artifact/build-artifacts/01:20:17_My_Additional_Software_list_is_configurable_through_a_GUI_or_through_notifications_when_I_install_or_remove_packages_with_APT_or_Synaptic.journal

After features/support/hooks.rb:108 0.010
6:36.663
Scenario Recovering in offline mode after Additional Software previously failed to upgrade and then succeed to upgrade when online
Before features/support/hooks.rb:274 0.000
Before features/support/hooks.rb:281 0.002
Before features/support/hooks.rb:527 0.001
Steps
Given a computer 0.114
And I start Tails from USB drive "__internal" and I login with persistence enabled and an administration password 6:36.549
try_for() timeout expired (Timeout::Error)
./features/support/helpers/misc_helpers.rb:145:in `rescue in try_for'
./features/support/helpers/misc_helpers.rb:51:in `try_for'
./features/step_definitions/common_steps.rb:764:in `/^available upgrades have been checked$/'
./features/step_definitions/common_steps.rb:259:in `/^I start Tails from (.+?) drive "(.+?)"( with network unplugged)?( and I login( with persistence enabled)?( with the changed persistence passphrase)?( (?:and|with) an administration password)?)?$/'
features/additional_software_packages.feature:79:in `And I start Tails from USB drive "__internal" and I login with persistence enabled and an administration password'
And I configure APT to prefer an old version of cowsay 0.000
When I install an old version "3.03+dfsg2-1" of the cowsay package using apt 0.000
And I accept adding "cowsay" to Additional Software 0.000
And Additional Software is correctly configured for package "cowsay" 0.000
And I shutdown Tails and wait for the computer to power off 0.000
And I start Tails from USB drive "__internal" with network unplugged 0.000
And I enable persistence 0.000
# We need to add back this custom APT source for the Additional Software
# install step, as it was not saved in persistence
And I configure APT to prefer an old version of cowsay 0.000
# Prevent the "Warning: virtual machine detected!" notification from racing
# with the one we'll be interacting with below.
And I disable the tails-virt-notify-user.service user unit 0.000
And I log in to a new session 0.000
And the installed version of package "cowsay" is "3.03+dfsg2-1" after Additional Software has been installed 0.000
And I revert the APT tweaks that made it prefer an old version of cowsay 0.000
# We remove the newest package after it has been downloaded and before
# it is installed, so that the upgrade process fails
And I prepare the Additional Software upgrade process to fail 0.000
And the network is plugged 0.000
And Tor is ready 0.000
And available upgrades have been checked 0.000
And I see the "The upgrade of your additional software failed" notification after at most 300 seconds 0.000
And I can open the Additional Software configuration window from the notification 0.000
And I shutdown Tails and wait for the computer to power off 0.000
And I start Tails from USB drive "__internal" with network unplugged 0.000
And I enable persistence 0.000
# We need to add back this custom APT source for the Additional Software
# install step, as it was not saved in persistence
And I configure APT to prefer an old version of cowsay 0.000
And I log in to a new session 0.000
And the installed version of package "cowsay" is "3.03+dfsg2-1" after Additional Software has been installed 0.000
And I revert the APT tweaks that made it prefer an old version of cowsay 0.000
And the network is plugged 0.000
And Tor is ready 0.000
Then the Additional Software upgrade service has started 0.000
And the installed version of package "cowsay" is newer than "3.03+dfsg2-1" 0.000
After features/support/hooks.rb:535 0.036
After features/support/hooks.rb:339 4.881

SCENARIO FAILED: 'Recovering in offline mode after Additional Software previously failed to upgrade and then succeed to upgrade when online' (at time 01:26:59)

Boot log: https://jenkins.tails.net/job/test_Tails_ISO_stable/6692/artifact/build-artifacts/01:26:59_Recovering_in_offline_mode_after_Additional_Software_previously_failed_to_upgrade_and_then_succeed_to_upgrade_when_online.file_content_var_log_boot.log

Content of /run/live-additional-software/log: https://jenkins.tails.net/job/test_Tails_ISO_stable/6692/artifact/build-artifacts/01:26:59_Recovering_in_offline_mode_after_Additional_Software_previously_failed_to_upgrade_and_then_succeed_to_upgrade_when_online.file_content_run_live-additional-software_log

Output of ls -la --full-time /live/persistence/tailsdata_unlocked: https://jenkins.tails.net/job/test_Tails_ISO_stable/6692/artifact/build-artifacts/01:26:59_Recovering_in_offline_mode_after_Additional_Software_previously_failed_to_upgrade_and_then_succeed_to_upgrade_when_online.cmd_output_persistent_volume

Output of ls -lar --full-time /var/cache/apt: https://jenkins.tails.net/job/test_Tails_ISO_stable/6692/artifact/build-artifacts/01:26:59_Recovering_in_offline_mode_after_Additional_Software_previously_failed_to_upgrade_and_then_succeed_to_upgrade_when_online.cmd_output_var_cache_apt

Output of ls -lar --full-time /var/lib/apt: https://jenkins.tails.net/job/test_Tails_ISO_stable/6692/artifact/build-artifacts/01:26:59_Recovering_in_offline_mode_after_Additional_Software_previously_failed_to_upgrade_and_then_succeed_to_upgrade_when_online.cmd_output_var_lib_apt

Output of mount: https://jenkins.tails.net/job/test_Tails_ISO_stable/6692/artifact/build-artifacts/01:26:59_Recovering_in_offline_mode_after_Additional_Software_previously_failed_to_upgrade_and_then_succeed_to_upgrade_when_online.cmd_output_mount

Screenshot: https://jenkins.tails.net/job/test_Tails_ISO_stable/6692/artifact/build-artifacts/01:26:59_Recovering_in_offline_mode_after_Additional_Software_previously_failed_to_upgrade_and_then_succeed_to_upgrade_when_online.png

Video: https://jenkins.tails.net/job/test_Tails_ISO_stable/6692/artifact/build-artifacts/01:26:59_Recovering_in_offline_mode_after_Additional_Software_previously_failed_to_upgrade_and_then_succeed_to_upgrade_when_online.mkv

Systemd journal: https://jenkins.tails.net/job/test_Tails_ISO_stable/6692/artifact/build-artifacts/01:26:59_Recovering_in_offline_mode_after_Additional_Software_previously_failed_to_upgrade_and_then_succeed_to_upgrade_when_online.journal

After features/support/hooks.rb:108 0.005
43.685
Scenario I am notified when Additional Software fails to install a package
Before features/support/hooks.rb:274 0.000
Before features/support/hooks.rb:281 0.001
Before features/support/hooks.rb:527 0.001
Steps
Given a computer 0.090
And I start Tails from USB drive "__internal" with network unplugged 32.349
And I enable persistence 11.199
And I remove the "cowsay" deb files from the APT cache 0.045
Command failed: rm /live/persistence/TailsData_unlocked/apt/cache/cowsay_*.deb
error code: 1
stdout: 
stderr: rm: cannot remove '/live/persistence/TailsData_unlocked/apt/cache/cowsay_*.deb': No such file or directory
.
<false> is not true. (ExecutionFailedInVM)
./features/support/helpers/vm_helper.rb:496:in `rescue in execute_successfully'
./features/support/helpers/vm_helper.rb:493:in `execute_successfully'
./features/step_definitions/additional_software_packages.rb:129:in `/^I remove the "([^"]*)" deb files from the APT cache$/'
features/additional_software_packages.feature:124:in `And I remove the "cowsay" deb files from the APT cache'
And I log in to a new session 0.000
Then I see the "The installation of your additional software failed" notification after at most 300 seconds 0.000
And I can open the Additional Software log file from the notification 0.000
And the package "cowsay" is not installed 0.000
After features/support/hooks.rb:535 0.033
After features/support/hooks.rb:339 5.181

SCENARIO FAILED: 'I am notified when Additional Software fails to install a package' (at time 01:27:48)

Exception thrown while trying to save /tmp/TailsToaster/artifact.file_content_run_live-additional-software_log: RemoteShell::ServerFailure: FileNotFoundError: [Errno 2] No such file or directory: '/run/live-additional-software/log'

Boot log: https://jenkins.tails.net/job/test_Tails_ISO_stable/6692/artifact/build-artifacts/01:27:48_I_am_notified_when_Additional_Software_fails_to_install_a_package.file_content_var_log_boot.log

Output of ls -la --full-time /live/persistence/tailsdata_unlocked: https://jenkins.tails.net/job/test_Tails_ISO_stable/6692/artifact/build-artifacts/01:27:48_I_am_notified_when_Additional_Software_fails_to_install_a_package.cmd_output_persistent_volume

Output of ls -lar --full-time /var/cache/apt: https://jenkins.tails.net/job/test_Tails_ISO_stable/6692/artifact/build-artifacts/01:27:48_I_am_notified_when_Additional_Software_fails_to_install_a_package.cmd_output_var_cache_apt

Output of ls -lar --full-time /var/lib/apt: https://jenkins.tails.net/job/test_Tails_ISO_stable/6692/artifact/build-artifacts/01:27:48_I_am_notified_when_Additional_Software_fails_to_install_a_package.cmd_output_var_lib_apt

Output of mount: https://jenkins.tails.net/job/test_Tails_ISO_stable/6692/artifact/build-artifacts/01:27:48_I_am_notified_when_Additional_Software_fails_to_install_a_package.cmd_output_mount

Screenshot: https://jenkins.tails.net/job/test_Tails_ISO_stable/6692/artifact/build-artifacts/01:27:48_I_am_notified_when_Additional_Software_fails_to_install_a_package.png

Video: https://jenkins.tails.net/job/test_Tails_ISO_stable/6692/artifact/build-artifacts/01:27:48_I_am_notified_when_Additional_Software_fails_to_install_a_package.mkv

Systemd journal: https://jenkins.tails.net/job/test_Tails_ISO_stable/6692/artifact/build-artifacts/01:27:48_I_am_notified_when_Additional_Software_fails_to_install_a_package.journal

After features/support/hooks.rb:108 0.005