Project Number Date
test_Tails_ISO_stable-flatpak 45 13 Oct 2026, 20:18

Feature Report

Steps Scenarios Features
Feature Passed Failed Skipped Pending Undefined Total Passed Failed Total Duration Status
Browsing the web using the Tor Browser 48 17 52 0 0 117 0 17 17 23:49.281 Failed
Tags: @product
Feature Browsing the web using the Tor Browser
As a Tails user when I browse the web using the Tor Browser all Internet traffic should flow only through Tor
Tags: @product
1:15.470
Scenario The Tor Browser cannot access the LAN
Before features/support/hooks.rb:274 0.000
Before features/support/hooks.rb:281 0.004
Steps
Given I have started Tails from DVD and logged in and the network is connected 9.646
And a web server is running on the LAN 1.028
And I capture all network traffic 0.005
When I start the Tor Browser 1:4.789
can
can not find any of the patterns ["TorBrowserAboutTor.png", "TorBrowser2025YECBanner.png", "TorBrowser2025YECBannerRTL.png"] on the screen (FindFailed)
./features/support/helpers/screen.rb:248:in `rescue in wait_any'
./features/support/helpers/screen.rb:232:in `wait_any'
./features/step_definitions/browser.rb:538:in `/^the Tor Browser loads about:tor$/'
./features/step_definitions/browser.rb:499:in `/^I start the Tor Browser( in offline mode)?$/'
features/torified_browsing.feature:11:in `When I start the Tor Browser'
And I open a page on the LAN web server in the Tor Browser 0.000
Then the Tor Browser shows the "Unable to connect" error 0.000
And no traffic was sent to the web server on the LAN 0.000
After features/support/hooks.rb:339 5.214

SCENARIO FAILED: 'The Tor Browser cannot access the LAN' (at time 03:49:41)

Boot log: https://jenkins.tails.net/job/test_Tails_ISO_stable-flatpak/45/artifact/build-artifacts/03:49:41_The_Tor_Browser_cannot_access_the_LAN.file_content_var_log_boot.log

Screenshot: https://jenkins.tails.net/job/test_Tails_ISO_stable-flatpak/45/artifact/build-artifacts/03:49:41_The_Tor_Browser_cannot_access_the_LAN.png

Video: https://jenkins.tails.net/job/test_Tails_ISO_stable-flatpak/45/artifact/build-artifacts/03:49:41_The_Tor_Browser_cannot_access_the_LAN.mkv

Systemd journal: https://jenkins.tails.net/job/test_Tails_ISO_stable-flatpak/45/artifact/build-artifacts/03:49:41_The_Tor_Browser_cannot_access_the_LAN.journal

After features/support/hooks.rb:108 0.058
1:30.010
Scenario The Downloads directory is usable in Tor Browser
Before features/support/hooks.rb:274 0.000
Before features/support/hooks.rb:281 0.010
Before features/support/hooks.rb:527 0.021
Steps
Given I have started Tails from DVD and logged in and the network is connected 9.908
Then the live user's Downloads directory exists 0.039
And there is a GNOME bookmark for the Downloads directory 14.080
When I start the Tor Browser 1:5.981
can
can not find any of the patterns ["TorBrowserAboutTor.png", "TorBrowser2025YECBanner.png", "TorBrowser2025YECBannerRTL.png"] on the screen (FindFailed)
./features/support/helpers/screen.rb:248:in `rescue in wait_any'
./features/support/helpers/screen.rb:232:in `wait_any'
./features/step_definitions/browser.rb:538:in `/^the Tor Browser loads about:tor$/'
./features/step_definitions/browser.rb:499:in `/^I start the Tor Browser( in offline mode)?$/'
features/torified_browsing.feature:21:in `When I start the Tor Browser'
Then I can save the current page as "index.html" to the Downloads directory 0.000
And I can print the current page as "output.pdf" to the Downloads directory 0.000
After features/support/hooks.rb:535 0.037
After features/support/hooks.rb:339 5.297

SCENARIO FAILED: 'The Downloads directory is usable in Tor Browser' (at time 03:51:16)

Boot log: https://jenkins.tails.net/job/test_Tails_ISO_stable-flatpak/45/artifact/build-artifacts/03:51:16_The_Downloads_directory_is_usable_in_Tor_Browser.file_content_var_log_boot.log

Screenshot: https://jenkins.tails.net/job/test_Tails_ISO_stable-flatpak/45/artifact/build-artifacts/03:51:16_The_Downloads_directory_is_usable_in_Tor_Browser.png

Video: https://jenkins.tails.net/job/test_Tails_ISO_stable-flatpak/45/artifact/build-artifacts/03:51:16_The_Downloads_directory_is_usable_in_Tor_Browser.mkv

Systemd journal: https://jenkins.tails.net/job/test_Tails_ISO_stable-flatpak/45/artifact/build-artifacts/03:51:16_The_Downloads_directory_is_usable_in_Tor_Browser.journal

After features/support/hooks.rb:108 0.000
1:15.844
Scenario Downloading files with the Tor Browser
Before features/support/hooks.rb:274 0.000
Before features/support/hooks.rb:281 0.004
Before features/support/hooks.rb:527 0.003
Steps
Given I have started Tails from DVD and logged in and the network is connected 9.559
When I start the Tor Browser 1:6.285
can
can not find any of the patterns ["TorBrowserAboutTor.png", "TorBrowser2025YECBanner.png", "TorBrowser2025YECBannerRTL.png"] on the screen (FindFailed)
./features/support/helpers/screen.rb:248:in `rescue in wait_any'
./features/support/helpers/screen.rb:232:in `wait_any'
./features/step_definitions/browser.rb:538:in `/^the Tor Browser loads about:tor$/'
./features/step_definitions/browser.rb:499:in `/^I start the Tor Browser( in offline mode)?$/'
features/torified_browsing.feature:28:in `When I start the Tor Browser'
When I download some file in the Tor Browser to the Downloads directory 0.000
Then the file is saved to the Downloads directory 0.000
After features/support/hooks.rb:535 0.038
After features/support/hooks.rb:339 6.225

SCENARIO FAILED: 'Downloading files with the Tor Browser' (at time 03:52:37)

Boot log: https://jenkins.tails.net/job/test_Tails_ISO_stable-flatpak/45/artifact/build-artifacts/03:52:37_Downloading_files_with_the_Tor_Browser.file_content_var_log_boot.log

Screenshot: https://jenkins.tails.net/job/test_Tails_ISO_stable-flatpak/45/artifact/build-artifacts/03:52:37_Downloading_files_with_the_Tor_Browser.png

Video: https://jenkins.tails.net/job/test_Tails_ISO_stable-flatpak/45/artifact/build-artifacts/03:52:37_Downloading_files_with_the_Tor_Browser.mkv

Systemd journal: https://jenkins.tails.net/job/test_Tails_ISO_stable-flatpak/45/artifact/build-artifacts/03:52:37_Downloading_files_with_the_Tor_Browser.journal

After features/support/hooks.rb:108 0.000
1:15.038
Scenario Playing an Ogg audio track
Before features/support/hooks.rb:274 0.000
Before features/support/hooks.rb:281 0.004
Before features/support/hooks.rb:527 0.003
Steps
Given I have started Tails from DVD and logged in and the network is connected 9.717
When I start the Tor Browser 1:5.321
can
can not find any of the patterns ["TorBrowserAboutTor.png", "TorBrowser2025YECBanner.png", "TorBrowser2025YECBannerRTL.png"] on the screen (FindFailed)
./features/support/helpers/screen.rb:248:in `rescue in wait_any'
./features/support/helpers/screen.rb:232:in `wait_any'
./features/step_definitions/browser.rb:538:in `/^the Tor Browser loads about:tor$/'
./features/step_definitions/browser.rb:499:in `/^I start the Tor Browser( in offline mode)?$/'
features/torified_browsing.feature:35:in `When I start the Tor Browser'
Then I can listen to an Ogg audio track in Tor Browser 0.000
After features/support/hooks.rb:535 0.053
After features/support/hooks.rb:339 5.166

SCENARIO FAILED: 'Playing an Ogg audio track' (at time 03:53:58)

Boot log: https://jenkins.tails.net/job/test_Tails_ISO_stable-flatpak/45/artifact/build-artifacts/03:53:58_Playing_an_Ogg_audio_track.file_content_var_log_boot.log

Screenshot: https://jenkins.tails.net/job/test_Tails_ISO_stable-flatpak/45/artifact/build-artifacts/03:53:58_Playing_an_Ogg_audio_track.png

Video: https://jenkins.tails.net/job/test_Tails_ISO_stable-flatpak/45/artifact/build-artifacts/03:53:58_Playing_an_Ogg_audio_track.mkv

Systemd journal: https://jenkins.tails.net/job/test_Tails_ISO_stable-flatpak/45/artifact/build-artifacts/03:53:58_Playing_an_Ogg_audio_track.journal

After features/support/hooks.rb:108 0.000
1:14.985
Scenario Watching a WebM video
Before features/support/hooks.rb:274 0.000
Before features/support/hooks.rb:281 0.004
Before features/support/hooks.rb:527 0.002
Steps
Given I have started Tails from DVD and logged in and the network is connected 9.748
When I start the Tor Browser 1:5.236
can
can not find any of the patterns ["TorBrowserAboutTor.png", "TorBrowser2025YECBanner.png", "TorBrowser2025YECBannerRTL.png"] on the screen (FindFailed)
./features/support/helpers/screen.rb:248:in `rescue in wait_any'
./features/support/helpers/screen.rb:232:in `wait_any'
./features/step_definitions/browser.rb:538:in `/^the Tor Browser loads about:tor$/'
./features/step_definitions/browser.rb:499:in `/^I start the Tor Browser( in offline mode)?$/'
features/torified_browsing.feature:41:in `When I start the Tor Browser'
Then I can watch a WebM video in Tor Browser 0.000
After features/support/hooks.rb:535 0.045
After features/support/hooks.rb:339 5.180

SCENARIO FAILED: 'Watching a WebM video' (at time 03:55:19)

Boot log: https://jenkins.tails.net/job/test_Tails_ISO_stable-flatpak/45/artifact/build-artifacts/03:55:19_Watching_a_WebM_video.file_content_var_log_boot.log

Screenshot: https://jenkins.tails.net/job/test_Tails_ISO_stable-flatpak/45/artifact/build-artifacts/03:55:19_Watching_a_WebM_video.png

Video: https://jenkins.tails.net/job/test_Tails_ISO_stable-flatpak/45/artifact/build-artifacts/03:55:19_Watching_a_WebM_video.mkv

Systemd journal: https://jenkins.tails.net/job/test_Tails_ISO_stable-flatpak/45/artifact/build-artifacts/03:55:19_Watching_a_WebM_video.journal

After features/support/hooks.rb:108 0.000
Tags: @product
1:14.765
Scenario I can view a file stored in "~/Downloads" but not in ~/.gnupg
Before features/support/hooks.rb:274 0.000
Before features/support/hooks.rb:281 0.004
Steps
Given I have started Tails from DVD and logged in and the network is connected 9.553
And I copy "/usr/share/synaptic/html/index.html" to "/home/amnesia/Downloads/synaptic.html" as user "amnesia" 0.070
And I copy "/usr/share/synaptic/html/index.html" to "/home/amnesia/.gnupg/synaptic.html" as user "amnesia" 0.055
And I copy "/usr/share/synaptic/html/index.html" to "/tmp/synaptic.html" as user "amnesia" 0.032
Then the file "/home/amnesia/.gnupg/synaptic.html" exists 0.067
And the file "/lib/live/mount/overlay/rw/home/amnesia/.gnupg/synaptic.html" exists 0.034
And the file "/live/overlay/rw/home/amnesia/.gnupg/synaptic.html" exists 0.029
And the file "/tmp/synaptic.html" exists 0.025
Given I start monitoring the AppArmor log of "torbrowser_firefox" 0.055
When I start the Tor Browser 1:4.842
can
can not find any of the patterns ["TorBrowserAboutTor.png", "TorBrowser2025YECBanner.png", "TorBrowser2025YECBannerRTL.png"] on the screen (FindFailed)
./features/support/helpers/screen.rb:248:in `rescue in wait_any'
./features/support/helpers/screen.rb:232:in `wait_any'
./features/step_definitions/browser.rb:538:in `/^the Tor Browser loads about:tor$/'
./features/step_definitions/browser.rb:499:in `/^I start the Tor Browser( in offline mode)?$/'
features/torified_browsing.feature:54:in `When I start the Tor Browser'
And I open the address "file:///home/amnesia/Downloads/synaptic.html" in the Tor Browser 0.000
Then I see "TorBrowserSynapticManual.png" after at most 5 seconds 0.000
And AppArmor has not denied "torbrowser_firefox" from opening "/home/amnesia/Downloads/synaptic.html" 0.000
When I open the address "file:///home/amnesia/.gnupg/synaptic.html" in the Tor Browser 0.000
Then I do not see "TorBrowserSynapticManual.png" after at most 5 seconds 0.000
When I open the address "file:///lib/live/mount/overlay/rw/home/amnesia/.gnupg/synaptic.html" in the Tor Browser 0.000
Then I do not see "TorBrowserSynapticManual.png" after at most 5 seconds 0.000
When I open the address "file:///live/overlay/rw/home/amnesia/.gnupg/synaptic.html" in the Tor Browser 0.000
Then I do not see "TorBrowserSynapticManual.png" after at most 5 seconds 0.000
When I open the address "file:///tmp/synaptic.html" in the Tor Browser 0.000
Then I do not see "TorBrowserSynapticManual.png" after at most 5 seconds 0.000
After features/support/hooks.rb:339 5.404

SCENARIO FAILED: 'I can view a file stored in "~/Downloads" but not in ~/.gnupg' (at time 03:56:39)

Boot log: https://jenkins.tails.net/job/test_Tails_ISO_stable-flatpak/45/artifact/build-artifacts/03:56:39_I_can_view_a_file_stored_in____Downloads__but_not_in___.gnupg.file_content_var_log_boot.log

Screenshot: https://jenkins.tails.net/job/test_Tails_ISO_stable-flatpak/45/artifact/build-artifacts/03:56:39_I_can_view_a_file_stored_in____Downloads__but_not_in___.gnupg.png

Video: https://jenkins.tails.net/job/test_Tails_ISO_stable-flatpak/45/artifact/build-artifacts/03:56:39_I_can_view_a_file_stored_in____Downloads__but_not_in___.gnupg.mkv

Systemd journal: https://jenkins.tails.net/job/test_Tails_ISO_stable-flatpak/45/artifact/build-artifacts/03:56:39_I_can_view_a_file_stored_in____Downloads__but_not_in___.gnupg.journal

After features/support/hooks.rb:108 0.000
Tags: @product
1:15.090
Scenario The Tor Browser uses TBB's shared libraries
Before features/support/hooks.rb:274 0.000
Before features/support/hooks.rb:281 0.004
Steps
Given I have started Tails from DVD and logged in and the network is connected 9.555
When I start the Tor Browser 1:5.534
can
can not find any of the patterns ["TorBrowserAboutTor.png", "TorBrowser2025YECBanner.png", "TorBrowser2025YECBannerRTL.png"] on the screen (FindFailed)
./features/support/helpers/screen.rb:248:in `rescue in wait_any'
./features/support/helpers/screen.rb:232:in `wait_any'
./features/step_definitions/browser.rb:538:in `/^the Tor Browser loads about:tor$/'
./features/step_definitions/browser.rb:499:in `/^I start the Tor Browser( in offline mode)?$/'
features/torified_browsing.feature:69:in `When I start the Tor Browser'
Then the Tor Browser uses all expected TBB shared libraries 0.000
After features/support/hooks.rb:339 5.127

SCENARIO FAILED: 'The Tor Browser uses TBB's shared libraries' (at time 03:57:59)

Boot log: https://jenkins.tails.net/job/test_Tails_ISO_stable-flatpak/45/artifact/build-artifacts/03:57:59_The_Tor_Browser_uses_TBB_s_shared_libraries.file_content_var_log_boot.log

Screenshot: https://jenkins.tails.net/job/test_Tails_ISO_stable-flatpak/45/artifact/build-artifacts/03:57:59_The_Tor_Browser_uses_TBB_s_shared_libraries.png

Video: https://jenkins.tails.net/job/test_Tails_ISO_stable-flatpak/45/artifact/build-artifacts/03:57:59_The_Tor_Browser_uses_TBB_s_shared_libraries.mkv

Systemd journal: https://jenkins.tails.net/job/test_Tails_ISO_stable-flatpak/45/artifact/build-artifacts/03:57:59_The_Tor_Browser_uses_TBB_s_shared_libraries.journal

After features/support/hooks.rb:108 0.000
1:14.915
Scenario The Tor Browser's "New identity" feature works as expected
Before features/support/hooks.rb:274 0.000
Before features/support/hooks.rb:281 0.003
Before features/support/hooks.rb:527 0.002
Steps
Given I have started Tails from DVD and logged in and the network is connected 9.613
When I start the Tor Browser 1:5.302
can
can not find any of the patterns ["TorBrowserAboutTor.png", "TorBrowser2025YECBanner.png", "TorBrowser2025YECBannerRTL.png"] on the screen (FindFailed)
./features/support/helpers/screen.rb:248:in `rescue in wait_any'
./features/support/helpers/screen.rb:232:in `wait_any'
./features/step_definitions/browser.rb:538:in `/^the Tor Browser loads about:tor$/'
./features/step_definitions/browser.rb:499:in `/^I start the Tor Browser( in offline mode)?$/'
features/torified_browsing.feature:75:in `When I start the Tor Browser'
And I open the Tails homepage in the Tor Browser 0.000
Then the Tor Browser loads the Tails homepage 0.000
And the Tor Browser has 2 tabs open 0.000
When I request a new identity in Tor Browser 0.000
Then the Tor Browser loads about:tor 0.000
And the Tor Browser has 1 tab open 0.000
After features/support/hooks.rb:535 0.038
After features/support/hooks.rb:339 5.260

SCENARIO FAILED: 'The Tor Browser's "New identity" feature works as expected' (at time 03:59:19)

Boot log: https://jenkins.tails.net/job/test_Tails_ISO_stable-flatpak/45/artifact/build-artifacts/03:59:19_The_Tor_Browser_s__New_identity__feature_works_as_expected.file_content_var_log_boot.log

Screenshot: https://jenkins.tails.net/job/test_Tails_ISO_stable-flatpak/45/artifact/build-artifacts/03:59:19_The_Tor_Browser_s__New_identity__feature_works_as_expected.png

Video: https://jenkins.tails.net/job/test_Tails_ISO_stable-flatpak/45/artifact/build-artifacts/03:59:19_The_Tor_Browser_s__New_identity__feature_works_as_expected.mkv

Systemd journal: https://jenkins.tails.net/job/test_Tails_ISO_stable-flatpak/45/artifact/build-artifacts/03:59:19_The_Tor_Browser_s__New_identity__feature_works_as_expected.journal

After features/support/hooks.rb:108 0.000
Tags: @product
1:15.326
Scenario The Tor Browser's circuit view feature works as expected
Before features/support/hooks.rb:274 0.000
Before features/support/hooks.rb:281 0.004
Steps
Given I have started Tails from DVD and logged in and the network is connected 9.965
When I start the Tor Browser 1:5.360
can
can not find any of the patterns ["TorBrowserAboutTor.png", "TorBrowser2025YECBanner.png", "TorBrowser2025YECBannerRTL.png"] on the screen (FindFailed)
./features/support/helpers/screen.rb:248:in `rescue in wait_any'
./features/support/helpers/screen.rb:232:in `wait_any'
./features/step_definitions/browser.rb:538:in `/^the Tor Browser loads about:tor$/'
./features/step_definitions/browser.rb:499:in `/^I start the Tor Browser( in offline mode)?$/'
features/torified_browsing.feature:88:in `When I start the Tor Browser'
And I open the Tails homepage in the Tor Browser 0.000
Then the Tor Browser loads the Tails homepage 0.000
And Tor Browser's circuit view is working 0.000
After features/support/hooks.rb:339 5.411

SCENARIO FAILED: 'The Tor Browser's circuit view feature works as expected' (at time 04:00:40)

Boot log: https://jenkins.tails.net/job/test_Tails_ISO_stable-flatpak/45/artifact/build-artifacts/04:00:40_The_Tor_Browser_s_circuit_view_feature_works_as_expected.file_content_var_log_boot.log

Screenshot: https://jenkins.tails.net/job/test_Tails_ISO_stable-flatpak/45/artifact/build-artifacts/04:00:40_The_Tor_Browser_s_circuit_view_feature_works_as_expected.png

Video: https://jenkins.tails.net/job/test_Tails_ISO_stable-flatpak/45/artifact/build-artifacts/04:00:40_The_Tor_Browser_s_circuit_view_feature_works_as_expected.mkv

Systemd journal: https://jenkins.tails.net/job/test_Tails_ISO_stable-flatpak/45/artifact/build-artifacts/04:00:40_The_Tor_Browser_s_circuit_view_feature_works_as_expected.journal

After features/support/hooks.rb:108 0.000
Tags: @product
1:14.977
Scenario WebRTC is disabled in Tor Browser
Before features/support/hooks.rb:274 0.000
Before features/support/hooks.rb:281 0.004
Steps
Given I have started Tails from DVD and logged in and the network is connected 9.782
When I start the Tor Browser 1:5.194
can
can not find any of the patterns ["TorBrowserAboutTor.png", "TorBrowser2025YECBanner.png", "TorBrowser2025YECBannerRTL.png"] on the screen (FindFailed)
./features/support/helpers/screen.rb:248:in `rescue in wait_any'
./features/support/helpers/screen.rb:232:in `wait_any'
./features/step_definitions/browser.rb:538:in `/^the Tor Browser loads about:tor$/'
./features/step_definitions/browser.rb:499:in `/^I start the Tor Browser( in offline mode)?$/'
features/torified_browsing.feature:95:in `When I start the Tor Browser'
When I open the address "https://net.ipcalf.com/" in the Tor Browser 0.000
Then Tor Browser displays a 'ifconfig | grep inet | grep -v inet6 | cut -d" " -f2 | tail -n1' heading on the "Network IP Address via ipcalf.com" page 0.000
When I open the address "https://mozilla.github.io/webrtc-landing/pc_test.html" in the Tor Browser 0.000
Then Tor Browser displays a "RTCPeerConnection is missing!" heading on the "Simple RTCPeerConnection Video Test" page 0.000
After features/support/hooks.rb:339 5.186

SCENARIO FAILED: 'WebRTC is disabled in Tor Browser' (at time 04:02:00)

Boot log: https://jenkins.tails.net/job/test_Tails_ISO_stable-flatpak/45/artifact/build-artifacts/04:02:00_WebRTC_is_disabled_in_Tor_Browser.file_content_var_log_boot.log

Screenshot: https://jenkins.tails.net/job/test_Tails_ISO_stable-flatpak/45/artifact/build-artifacts/04:02:00_WebRTC_is_disabled_in_Tor_Browser.png

Video: https://jenkins.tails.net/job/test_Tails_ISO_stable-flatpak/45/artifact/build-artifacts/04:02:00_WebRTC_is_disabled_in_Tor_Browser.mkv

Systemd journal: https://jenkins.tails.net/job/test_Tails_ISO_stable-flatpak/45/artifact/build-artifacts/04:02:00_WebRTC_is_disabled_in_Tor_Browser.journal

After features/support/hooks.rb:108 0.000
Tags: @product
1:49.060
Scenario The Persistent directory is usable in Tor Browser
Before features/support/hooks.rb:274 0.000
Before features/support/hooks.rb:281 0.003
Steps
Given I have started Tails without network from a USB drive with a persistent partition enabled and logged in 8.491
And the network is plugged 0.039
And I successfully configure Tor 9.984
And available upgrades have been checked 1.104
And all notifications have disappeared 6.344
And there is a GNOME bookmark for the Persistent directory 17.133
When I start the Tor Browser 1:5.962
can
can not find any of the patterns ["TorBrowserAboutTor.png", "TorBrowser2025YECBanner.png", "TorBrowser2025YECBannerRTL.png"] on the screen (FindFailed)
./features/support/helpers/screen.rb:248:in `rescue in wait_any'
./features/support/helpers/screen.rb:232:in `wait_any'
./features/step_definitions/browser.rb:538:in `/^the Tor Browser loads about:tor$/'
./features/step_definitions/browser.rb:499:in `/^I start the Tor Browser( in offline mode)?$/'
features/torified_browsing.feature:108:in `When I start the Tor Browser'
And I download some file in the Tor Browser to the Persistent directory 0.000
Then the file is saved to the Persistent directory 0.000
When I open the address "https://tails.net/about" in the Tor Browser 0.000
Then "Tails - How Tails works" has loaded in the Tor Browser 0.000
And I can print the current page as "output.pdf" to the Persistent directory 0.000
After features/support/hooks.rb:339 5.135

SCENARIO FAILED: 'The Persistent directory is usable in Tor Browser' (at time 04:03:55)

Boot log: https://jenkins.tails.net/job/test_Tails_ISO_stable-flatpak/45/artifact/build-artifacts/04:03:55_The_Persistent_directory_is_usable_in_Tor_Browser.file_content_var_log_boot.log

Screenshot: https://jenkins.tails.net/job/test_Tails_ISO_stable-flatpak/45/artifact/build-artifacts/04:03:55_The_Persistent_directory_is_usable_in_Tor_Browser.png

Video: https://jenkins.tails.net/job/test_Tails_ISO_stable-flatpak/45/artifact/build-artifacts/04:03:55_The_Persistent_directory_is_usable_in_Tor_Browser.mkv

Systemd journal: https://jenkins.tails.net/job/test_Tails_ISO_stable-flatpak/45/artifact/build-artifacts/04:03:55_The_Persistent_directory_is_usable_in_Tor_Browser.journal

After features/support/hooks.rb:108 0.000
Tags: @product
1:31.951
Scenario Outline The default XDG directories are usable in Tor Browser
Before features/support/hooks.rb:274 0.000
Before features/support/hooks.rb:281 0.004
Steps
Given I have started Tails from DVD without network and logged in 6.643
Then the live user's Documents directory exists 0.055
And there is a GNOME bookmark for the Documents directory 15.019
Then I start the Tor Browser in offline mode 1:10.233
can
can not find any of the patterns ["TorBrowserAboutTor.png", "TorBrowser2025YECBanner.png", "TorBrowser2025YECBannerRTL.png"] on the screen (FindFailed)
./features/support/helpers/screen.rb:248:in `rescue in wait_any'
./features/support/helpers/screen.rb:232:in `wait_any'
./features/step_definitions/browser.rb:538:in `/^the Tor Browser loads about:tor$/'
./features/step_definitions/browser.rb:499:in `/^I start the Tor Browser( in offline mode)?$/'
features/torified_browsing.feature:123:in `Then I start the Tor Browser in offline mode'
features/torified_browsing.feature:119:in `Then I start the Tor Browser in offline mode'
And I can save the current page as "index.html" to the Documents GNOME bookmark 0.000
After features/support/hooks.rb:339 5.316

SCENARIO FAILED: 'The default XDG directories are usable in Tor Browser, Examples (#1)' (at time 04:05:32)

Boot log: https://jenkins.tails.net/job/test_Tails_ISO_stable-flatpak/45/artifact/build-artifacts/04:05:32_The_default_XDG_directories_are_usable_in_Tor_Browser,_Examples___1_.file_content_var_log_boot.log

Screenshot: https://jenkins.tails.net/job/test_Tails_ISO_stable-flatpak/45/artifact/build-artifacts/04:05:32_The_default_XDG_directories_are_usable_in_Tor_Browser,_Examples___1_.png

Video: https://jenkins.tails.net/job/test_Tails_ISO_stable-flatpak/45/artifact/build-artifacts/04:05:32_The_default_XDG_directories_are_usable_in_Tor_Browser,_Examples___1_.mkv

Systemd journal: https://jenkins.tails.net/job/test_Tails_ISO_stable-flatpak/45/artifact/build-artifacts/04:05:32_The_default_XDG_directories_are_usable_in_Tor_Browser,_Examples___1_.journal

After features/support/hooks.rb:108 0.000
Tags: @product
1:32.232
Scenario Outline The default XDG directories are usable in Tor Browser
Before features/support/hooks.rb:274 0.000
Before features/support/hooks.rb:281 0.004
Steps
Given I have started Tails from DVD without network and logged in 6.957
Then the live user's Downloads directory exists 0.066
And there is a GNOME bookmark for the Downloads directory 15.203
Then I start the Tor Browser in offline mode 1:10.004
can
can not find any of the patterns ["TorBrowserAboutTor.png", "TorBrowser2025YECBanner.png", "TorBrowser2025YECBannerRTL.png"] on the screen (FindFailed)
./features/support/helpers/screen.rb:248:in `rescue in wait_any'
./features/support/helpers/screen.rb:232:in `wait_any'
./features/step_definitions/browser.rb:538:in `/^the Tor Browser loads about:tor$/'
./features/step_definitions/browser.rb:499:in `/^I start the Tor Browser( in offline mode)?$/'
features/torified_browsing.feature:124:in `Then I start the Tor Browser in offline mode'
features/torified_browsing.feature:119:in `Then I start the Tor Browser in offline mode'
And I can save the current page as "index.html" to the Downloads GNOME bookmark 0.000
After features/support/hooks.rb:339 4.946

SCENARIO FAILED: 'The default XDG directories are usable in Tor Browser, Examples (#2)' (at time 04:07:09)

Boot log: https://jenkins.tails.net/job/test_Tails_ISO_stable-flatpak/45/artifact/build-artifacts/04:07:09_The_default_XDG_directories_are_usable_in_Tor_Browser,_Examples___2_.file_content_var_log_boot.log

Screenshot: https://jenkins.tails.net/job/test_Tails_ISO_stable-flatpak/45/artifact/build-artifacts/04:07:09_The_default_XDG_directories_are_usable_in_Tor_Browser,_Examples___2_.png

Video: https://jenkins.tails.net/job/test_Tails_ISO_stable-flatpak/45/artifact/build-artifacts/04:07:09_The_default_XDG_directories_are_usable_in_Tor_Browser,_Examples___2_.mkv

Systemd journal: https://jenkins.tails.net/job/test_Tails_ISO_stable-flatpak/45/artifact/build-artifacts/04:07:09_The_default_XDG_directories_are_usable_in_Tor_Browser,_Examples___2_.journal

After features/support/hooks.rb:108 0.000
Tags: @product
1:31.377
Scenario Outline The default XDG directories are usable in Tor Browser
Before features/support/hooks.rb:274 0.000
Before features/support/hooks.rb:281 0.003
Steps
Given I have started Tails from DVD without network and logged in 6.512
Then the live user's Music directory exists 0.038
And there is a GNOME bookmark for the Music directory 14.936
Then I start the Tor Browser in offline mode 1:9.889
can
can not find any of the patterns ["TorBrowserAboutTor.png", "TorBrowser2025YECBanner.png", "TorBrowser2025YECBannerRTL.png"] on the screen (FindFailed)
./features/support/helpers/screen.rb:248:in `rescue in wait_any'
./features/support/helpers/screen.rb:232:in `wait_any'
./features/step_definitions/browser.rb:538:in `/^the Tor Browser loads about:tor$/'
./features/step_definitions/browser.rb:499:in `/^I start the Tor Browser( in offline mode)?$/'
features/torified_browsing.feature:125:in `Then I start the Tor Browser in offline mode'
features/torified_browsing.feature:119:in `Then I start the Tor Browser in offline mode'
And I can save the current page as "index.html" to the Music GNOME bookmark 0.000
After features/support/hooks.rb:339 5.351

SCENARIO FAILED: 'The default XDG directories are usable in Tor Browser, Examples (#3)' (at time 04:08:46)

Boot log: https://jenkins.tails.net/job/test_Tails_ISO_stable-flatpak/45/artifact/build-artifacts/04:08:46_The_default_XDG_directories_are_usable_in_Tor_Browser,_Examples___3_.file_content_var_log_boot.log

Screenshot: https://jenkins.tails.net/job/test_Tails_ISO_stable-flatpak/45/artifact/build-artifacts/04:08:46_The_default_XDG_directories_are_usable_in_Tor_Browser,_Examples___3_.png

Video: https://jenkins.tails.net/job/test_Tails_ISO_stable-flatpak/45/artifact/build-artifacts/04:08:46_The_default_XDG_directories_are_usable_in_Tor_Browser,_Examples___3_.mkv

Systemd journal: https://jenkins.tails.net/job/test_Tails_ISO_stable-flatpak/45/artifact/build-artifacts/04:08:46_The_default_XDG_directories_are_usable_in_Tor_Browser,_Examples___3_.journal

After features/support/hooks.rb:108 0.000
Tags: @product
1:32.294
Scenario Outline The default XDG directories are usable in Tor Browser
Before features/support/hooks.rb:274 0.000
Before features/support/hooks.rb:281 0.005
Steps
Given I have started Tails from DVD without network and logged in 6.837
Then the live user's Pictures directory exists 0.063
And there is a GNOME bookmark for the Pictures directory 15.310
Then I start the Tor Browser in offline mode 1:10.082
can
can not find any of the patterns ["TorBrowserAboutTor.png", "TorBrowser2025YECBanner.png", "TorBrowser2025YECBannerRTL.png"] on the screen (FindFailed)
./features/support/helpers/screen.rb:248:in `rescue in wait_any'
./features/support/helpers/screen.rb:232:in `wait_any'
./features/step_definitions/browser.rb:538:in `/^the Tor Browser loads about:tor$/'
./features/step_definitions/browser.rb:499:in `/^I start the Tor Browser( in offline mode)?$/'
features/torified_browsing.feature:126:in `Then I start the Tor Browser in offline mode'
features/torified_browsing.feature:119:in `Then I start the Tor Browser in offline mode'
And I can save the current page as "index.html" to the Pictures GNOME bookmark 0.000
After features/support/hooks.rb:339 5.474

SCENARIO FAILED: 'The default XDG directories are usable in Tor Browser, Examples (#4)' (at time 04:10:24)

Boot log: https://jenkins.tails.net/job/test_Tails_ISO_stable-flatpak/45/artifact/build-artifacts/04:10:24_The_default_XDG_directories_are_usable_in_Tor_Browser,_Examples___4_.file_content_var_log_boot.log

Screenshot: https://jenkins.tails.net/job/test_Tails_ISO_stable-flatpak/45/artifact/build-artifacts/04:10:24_The_default_XDG_directories_are_usable_in_Tor_Browser,_Examples___4_.png

Video: https://jenkins.tails.net/job/test_Tails_ISO_stable-flatpak/45/artifact/build-artifacts/04:10:24_The_default_XDG_directories_are_usable_in_Tor_Browser,_Examples___4_.mkv

Systemd journal: https://jenkins.tails.net/job/test_Tails_ISO_stable-flatpak/45/artifact/build-artifacts/04:10:24_The_default_XDG_directories_are_usable_in_Tor_Browser,_Examples___4_.journal

After features/support/hooks.rb:108 0.000
Tags: @product
1:32.251
Scenario Outline The default XDG directories are usable in Tor Browser
Before features/support/hooks.rb:274 0.000
Before features/support/hooks.rb:281 0.004
Steps
Given I have started Tails from DVD without network and logged in 6.868
Then the live user's Videos directory exists 0.047
And there is a GNOME bookmark for the Videos directory 15.288
Then I start the Tor Browser in offline mode 1:10.046
can
can not find any of the patterns ["TorBrowserAboutTor.png", "TorBrowser2025YECBanner.png", "TorBrowser2025YECBannerRTL.png"] on the screen (FindFailed)
./features/support/helpers/screen.rb:248:in `rescue in wait_any'
./features/support/helpers/screen.rb:232:in `wait_any'
./features/step_definitions/browser.rb:538:in `/^the Tor Browser loads about:tor$/'
./features/step_definitions/browser.rb:499:in `/^I start the Tor Browser( in offline mode)?$/'
features/torified_browsing.feature:127:in `Then I start the Tor Browser in offline mode'
features/torified_browsing.feature:119:in `Then I start the Tor Browser in offline mode'
And I can save the current page as "index.html" to the Videos GNOME bookmark 0.000
After features/support/hooks.rb:339 5.379

SCENARIO FAILED: 'The default XDG directories are usable in Tor Browser, Examples (#5)' (at time 04:12:01)

Boot log: https://jenkins.tails.net/job/test_Tails_ISO_stable-flatpak/45/artifact/build-artifacts/04:12:01_The_default_XDG_directories_are_usable_in_Tor_Browser,_Examples___5_.file_content_var_log_boot.log

Screenshot: https://jenkins.tails.net/job/test_Tails_ISO_stable-flatpak/45/artifact/build-artifacts/04:12:01_The_default_XDG_directories_are_usable_in_Tor_Browser,_Examples___5_.png

Video: https://jenkins.tails.net/job/test_Tails_ISO_stable-flatpak/45/artifact/build-artifacts/04:12:01_The_default_XDG_directories_are_usable_in_Tor_Browser,_Examples___5_.mkv

Systemd journal: https://jenkins.tails.net/job/test_Tails_ISO_stable-flatpak/45/artifact/build-artifacts/04:12:01_The_default_XDG_directories_are_usable_in_Tor_Browser,_Examples___5_.journal

After features/support/hooks.rb:108 0.000
Tags: @product
1:33.687
Scenario Persistent browser bookmarks
Before features/support/hooks.rb:274 0.000
Before features/support/hooks.rb:281 0.004
Steps
Given I have started Tails without network from a USB drive with a persistent partition enabled and logged in 7.727
And all tps features are active 9.746
And all persistent filesystems have safe access rights 0.139
And all persistence configuration files have safe access rights 0.236
And all persistent directories have safe access rights 1.949
When I start the Tor Browser in offline mode 1:13.887
can
can not find any of the patterns ["TorBrowserAboutTor.png", "TorBrowser2025YECBanner.png", "TorBrowser2025YECBannerRTL.png"] on the screen (FindFailed)
./features/support/helpers/screen.rb:248:in `rescue in wait_any'
./features/support/helpers/screen.rb:232:in `wait_any'
./features/step_definitions/browser.rb:538:in `/^the Tor Browser loads about:tor$/'
./features/step_definitions/browser.rb:499:in `/^I start the Tor Browser( in offline mode)?$/'
features/torified_browsing.feature:135:in `When I start the Tor Browser in offline mode'
And I add a bookmark to eff.org in the Tor Browser 0.000
And I cold reboot the computer 0.000
And the computer reboots Tails 0.000
And I enable persistence 0.000
And I log in to a new session 0.000
And all notifications have disappeared 0.000
And I start the Tor Browser in offline mode 0.000
Then the Tor Browser has a bookmark to eff.org 0.000
After features/support/hooks.rb:339 5.183

SCENARIO FAILED: 'Persistent browser bookmarks' (at time 04:13:40)

Boot log: https://jenkins.tails.net/job/test_Tails_ISO_stable-flatpak/45/artifact/build-artifacts/04:13:40_Persistent_browser_bookmarks.file_content_var_log_boot.log

Screenshot: https://jenkins.tails.net/job/test_Tails_ISO_stable-flatpak/45/artifact/build-artifacts/04:13:40_Persistent_browser_bookmarks.png

Video: https://jenkins.tails.net/job/test_Tails_ISO_stable-flatpak/45/artifact/build-artifacts/04:13:40_Persistent_browser_bookmarks.mkv

Systemd journal: https://jenkins.tails.net/job/test_Tails_ISO_stable-flatpak/45/artifact/build-artifacts/04:13:40_Persistent_browser_bookmarks.journal

After features/support/hooks.rb:108 0.000