Project Number Date
test_Tails_ISO_21565-flatpak-safe 52 26 Sep 2026, 03:39

Feature Report

Steps Scenarios Features
Feature Passed Failed Skipped Pending Undefined Total Passed Failed Total Duration Status
Installing and running Flatpak apps in Tails 2 3 31 0 0 36 1 3 4 8:5.573 Failed
Tags: @product
Feature Installing and running Flatpak apps in Tails
As a Tails user I may want to install and run software not shipped in Tails or Debian And keep them up-to-date
Tags: @product
0.036
Before features/support/hooks.rb:274 0.000
Before features/support/hooks.rb:281 0.001
Given I have the build manifest for the image under test 0.000
Then Debian package gnome-software-plugin-deb is not installed 0.036
After features/support/hooks.rb:339 0.615
After features/support/hooks.rb:108 0.000
2:36.853
Scenario GNOME Software does not start until Tor is ready
Before features/support/hooks.rb:274 0.000
Before features/support/hooks.rb:281 0.002
Before features/support/hooks.rb:527 0.010
Steps
Given I have started Tails without network with the Flatpak feature from a USB drive with a persistent partition enabled and logged in 2:36.853
Feature 'Flatpak' is not active.
<false> is not true. (Test::Unit::AssertionFailedError)
./features/step_definitions/usb.rb:800:in `block (2 levels) in <top (required)>'
./features/step_definitions/usb.rb:795:in `each'
./features/step_definitions/usb.rb:795:in `/^all tps features(| from the old Tails version)(| but the first one) are active$/'
./features/step_definitions/snapshots.rb:206:in `block in reach_checkpoint'
./features/step_definitions/snapshots.rb:203:in `each'
./features/step_definitions/snapshots.rb:203:in `reach_checkpoint'
./features/step_definitions/snapshots.rb:226:in `/^I\ have\ started\ Tails\ without\ network\ with\ the\ Flatpak\ feature\ from\ a\ USB\ drive\ with\ a\ persistent\ partition\ enabled\ and\ logged\ in$/'
features/flatpak.feature:13:in `Given I have started Tails without network with the Flatpak feature from a USB drive with a persistent partition enabled and logged in'
Then process "gnome-software" is not running 0.000
When I try to start GNOME Software 0.000
Then I see an error about GNOME Software requiring Tor to be ready 0.000
And I close the "zenity" window 0.000
And process "gnome-software" is not running 0.000
When the network is plugged 0.000
And Tor is ready 0.000
Then process "gnome-software" is running within 10 seconds 0.000
After features/support/hooks.rb:535 0.028
After features/support/hooks.rb:339 4.896

SCENARIO FAILED: 'GNOME Software does not start until Tor is ready' (at time 00:06:47)

Boot log: https://jenkins.tails.net/job/test_Tails_ISO_21565-flatpak-safe/52/artifact/build-artifacts/00:06:47_GNOME_Software_does_not_start_until_Tor_is_ready.file_content_var_log_boot.log

Screenshot: https://jenkins.tails.net/job/test_Tails_ISO_21565-flatpak-safe/52/artifact/build-artifacts/00:06:47_GNOME_Software_does_not_start_until_Tor_is_ready.png

Video: https://jenkins.tails.net/job/test_Tails_ISO_21565-flatpak-safe/52/artifact/build-artifacts/00:06:47_GNOME_Software_does_not_start_until_Tor_is_ready.mkv

Systemd journal: https://jenkins.tails.net/job/test_Tails_ISO_21565-flatpak-safe/52/artifact/build-artifacts/00:06:47_GNOME_Software_does_not_start_until_Tor_is_ready.journal

After features/support/hooks.rb:108 0.032
2:44.620
Scenario Installing, starting and uninstalling a Flatpak
Before features/support/hooks.rb:274 0.000
Before features/support/hooks.rb:281 0.001
Before features/support/hooks.rb:527 0.001
Steps
Given I have started Tails with the Flatpak feature from a USB drive with a persistent partition enabled and logged in and the network is connected 2:44.620
Feature 'Flatpak' is not active.
<false> is not true. (Test::Unit::AssertionFailedError)
./features/step_definitions/usb.rb:800:in `block (2 levels) in <top (required)>'
./features/step_definitions/usb.rb:795:in `each'
./features/step_definitions/usb.rb:795:in `/^all tps features(| from the old Tails version)(| but the first one) are active$/'
./features/step_definitions/snapshots.rb:206:in `block in reach_checkpoint'
./features/step_definitions/snapshots.rb:203:in `each'
./features/step_definitions/snapshots.rb:203:in `reach_checkpoint'
./features/step_definitions/snapshots.rb:190:in `reach_checkpoint'
./features/step_definitions/snapshots.rb:226:in `/^I\ have\ started\ Tails\ with\ the\ Flatpak\ feature\ from\ a\ USB\ drive\ with\ a\ persistent\ partition\ enabled\ and\ logged\ in\ and\ the\ network\ is\ connected$/'
features/flatpak.feature:25:in `Given I have started Tails with the Flatpak feature from a USB drive with a persistent partition enabled and logged in and the network is connected'
When I start GNOME Software 0.000
And I install Signal Desktop using GNOME Software 0.000
Then the org.signal.Signal Flatpak is installed after at most 600 seconds 0.000
When I start the org.signal.Signal Flatpak 0.000
Then the org.signal.Signal Flatpak is running 0.000
Given I kill the org.signal.Signal Flatpak 0.000
And I go to the main screen of GNOME Software 0.000
When I uninstall Signal Desktop using GNOME Software 0.000
Then the org.signal.Signal Flatpak is uninstalled after at most 60 seconds 0.000
After features/support/hooks.rb:535 0.038
After features/support/hooks.rb:339 4.570

SCENARIO FAILED: 'Installing, starting and uninstalling a Flatpak' (at time 00:09:36)

Boot log: https://jenkins.tails.net/job/test_Tails_ISO_21565-flatpak-safe/52/artifact/build-artifacts/00:09:36_Installing,_starting_and_uninstalling_a_Flatpak.file_content_var_log_boot.log

Screenshot: https://jenkins.tails.net/job/test_Tails_ISO_21565-flatpak-safe/52/artifact/build-artifacts/00:09:36_Installing,_starting_and_uninstalling_a_Flatpak.png

Video: https://jenkins.tails.net/job/test_Tails_ISO_21565-flatpak-safe/52/artifact/build-artifacts/00:09:36_Installing,_starting_and_uninstalling_a_Flatpak.mkv

Systemd journal: https://jenkins.tails.net/job/test_Tails_ISO_21565-flatpak-safe/52/artifact/build-artifacts/00:09:36_Installing,_starting_and_uninstalling_a_Flatpak.journal

After features/support/hooks.rb:108 0.007
2:44.062
Scenario Changing locale after installing a Flatpak
Before features/support/hooks.rb:274 0.000
Before features/support/hooks.rb:281 0.001
Before features/support/hooks.rb:527 0.001
Steps
Given I have started Tails with the Flatpak feature from a USB drive with a persistent partition enabled and logged in and the network is connected 2:44.062
Feature 'Flatpak' is not active.
<false> is not true. (Test::Unit::AssertionFailedError)
./features/step_definitions/usb.rb:800:in `block (2 levels) in <top (required)>'
./features/step_definitions/usb.rb:795:in `each'
./features/step_definitions/usb.rb:795:in `/^all tps features(| from the old Tails version)(| but the first one) are active$/'
./features/step_definitions/snapshots.rb:206:in `block in reach_checkpoint'
./features/step_definitions/snapshots.rb:203:in `each'
./features/step_definitions/snapshots.rb:203:in `reach_checkpoint'
./features/step_definitions/snapshots.rb:190:in `reach_checkpoint'
./features/step_definitions/snapshots.rb:226:in `/^I\ have\ started\ Tails\ with\ the\ Flatpak\ feature\ from\ a\ USB\ drive\ with\ a\ persistent\ partition\ enabled\ and\ logged\ in\ and\ the\ network\ is\ connected$/'
features/flatpak.feature:38:in `Given I have started Tails with the Flatpak feature from a USB drive with a persistent partition enabled and logged in and the network is connected'
When I start GNOME Software 0.000
And I install Thunderbird using GNOME Software 0.000
Then the org.mozilla.thunderbird Flatpak is installed after at most 600 seconds 0.000
And the "de" locale is not present in the org.mozilla.thunderbird.Locale Flatpak extension 0.000
Given I set Tails to boot with options "flatpak" 0.000
When I cold reboot the computer 0.000
Then the computer boots Tails 0.000
When I enable persistence 0.000
And I log in to a new session in German (de) 0.000
Given it has been 3 days since GNOME Software checked for updates 0.000
And GNOME Software thinks it is after 06:00 but before 23:00 0.000
When the network is plugged 0.000
And Tor is ready 0.000
Then the "de" locale is present in the org.mozilla.thunderbird.Locale Flatpak extension after at most 600 seconds 0.000
After features/support/hooks.rb:535 0.037
After features/support/hooks.rb:339 4.700

SCENARIO FAILED: 'Changing locale after installing a Flatpak' (at time 00:12:25)

Boot log: https://jenkins.tails.net/job/test_Tails_ISO_21565-flatpak-safe/52/artifact/build-artifacts/00:12:25_Changing_locale_after_installing_a_Flatpak.file_content_var_log_boot.log

Screenshot: https://jenkins.tails.net/job/test_Tails_ISO_21565-flatpak-safe/52/artifact/build-artifacts/00:12:25_Changing_locale_after_installing_a_Flatpak.png

Video: https://jenkins.tails.net/job/test_Tails_ISO_21565-flatpak-safe/52/artifact/build-artifacts/00:12:25_Changing_locale_after_installing_a_Flatpak.mkv

Systemd journal: https://jenkins.tails.net/job/test_Tails_ISO_21565-flatpak-safe/52/artifact/build-artifacts/00:12:25_Changing_locale_after_installing_a_Flatpak.journal

After features/support/hooks.rb:108 0.007