Project Number Date
test_Tails_ISO_21565-flatpak-safe 48 23 Sep 2026, 16:21

Failures Overview

The following summary displays scenarios that failed.

5:45.877
Scenario I set up Additional Software when installing a package without persistent partition and the package is installed next time I start Tails
Before features/support/hooks.rb:274 0.000
Before features/support/hooks.rb:281 0.002
Before features/support/hooks.rb:527 0.002
Steps
Given I start Tails from a freshly installed USB drive with an administration password and the network is plugged and I login 5:45.877
try_for() timeout expired (Timeout::Error)
./features/support/helpers/misc_helpers.rb:145:in `rescue in try_for'
./features/support/helpers/misc_helpers.rb:51:in `try_for'
./features/step_definitions/common_steps.rb:764:in `/^available upgrades have been checked$/'
./features/step_definitions/common_steps.rb:273:in `/^I start Tails from a freshly installed USB drive with an administration password and the network is plugged and I login$/'
features/additional_software_packages.feature:28:in `Given I start Tails from a freshly installed USB drive with an administration password and the network is plugged and I login'
And I update the APT lists using apt 0.000
And I install "popularity-contest" using apt 0.000
Then I am proposed to add the "popularity-contest" package to my Additional Software 0.000
When I create a persistent storage and activate the Additional Software feature 0.000
Then Additional Software is correctly configured for package "popularity-contest" 0.000
When I shutdown Tails and wait for the computer to power off 0.000
And I start Tails from USB drive "__internal" with network unplugged 0.000
And I enable persistence 0.000
And I log in to a new session 0.000
And the Additional Software installation service has started 0.000
Then I am notified that the installation succeeded 0.000
And Additional Software is correctly configured for package "popularity-contest" 0.000
And the package "popularity-contest" is installed after Additional Software has been installed 0.000
After features/support/hooks.rb:535 0.041
After features/support/hooks.rb:339 5.149

SCENARIO FAILED: 'I set up Additional Software when installing a package without persistent partition and the package is installed next time I start Tails' (at time 01:02:26)

Boot log: https://jenkins.tails.net/job/test_Tails_ISO_21565-flatpak-safe/48/artifact/build-artifacts/01:02:26_I_set_up_Additional_Software_when_installing_a_package_without_persistent_partition_and_the_package_is_installed_next_time_I_start_Tails.file_content_var_log_boot.log

Content of /run/live-additional-software/log: https://jenkins.tails.net/job/test_Tails_ISO_21565-flatpak-safe/48/artifact/build-artifacts/01:02:26_I_set_up_Additional_Software_when_installing_a_package_without_persistent_partition_and_the_package_is_installed_next_time_I_start_Tails.file_content_run_live-additional-software_log

Output of ls -la --full-time /live/persistence/tailsdata_unlocked: https://jenkins.tails.net/job/test_Tails_ISO_21565-flatpak-safe/48/artifact/build-artifacts/01:02:26_I_set_up_Additional_Software_when_installing_a_package_without_persistent_partition_and_the_package_is_installed_next_time_I_start_Tails.cmd_output_persistent_volume

Output of ls -lar --full-time /var/cache/apt: https://jenkins.tails.net/job/test_Tails_ISO_21565-flatpak-safe/48/artifact/build-artifacts/01:02:26_I_set_up_Additional_Software_when_installing_a_package_without_persistent_partition_and_the_package_is_installed_next_time_I_start_Tails.cmd_output_var_cache_apt

Output of ls -lar --full-time /var/lib/apt: https://jenkins.tails.net/job/test_Tails_ISO_21565-flatpak-safe/48/artifact/build-artifacts/01:02:26_I_set_up_Additional_Software_when_installing_a_package_without_persistent_partition_and_the_package_is_installed_next_time_I_start_Tails.cmd_output_var_lib_apt

Output of mount: https://jenkins.tails.net/job/test_Tails_ISO_21565-flatpak-safe/48/artifact/build-artifacts/01:02:26_I_set_up_Additional_Software_when_installing_a_package_without_persistent_partition_and_the_package_is_installed_next_time_I_start_Tails.cmd_output_mount

Screenshot: https://jenkins.tails.net/job/test_Tails_ISO_21565-flatpak-safe/48/artifact/build-artifacts/01:02:26_I_set_up_Additional_Software_when_installing_a_package_without_persistent_partition_and_the_package_is_installed_next_time_I_start_Tails.png

Video: https://jenkins.tails.net/job/test_Tails_ISO_21565-flatpak-safe/48/artifact/build-artifacts/01:02:26_I_set_up_Additional_Software_when_installing_a_package_without_persistent_partition_and_the_package_is_installed_next_time_I_start_Tails.mkv

Systemd journal: https://jenkins.tails.net/job/test_Tails_ISO_21565-flatpak-safe/48/artifact/build-artifacts/01:02:26_I_set_up_Additional_Software_when_installing_a_package_without_persistent_partition_and_the_package_is_installed_next_time_I_start_Tails.journal

After features/support/hooks.rb:108 0.000
4:14.457
Scenario The Additional Software dpkg hook notices when persistence is locked down while installing a package
Before features/support/hooks.rb:274 0.000
Before features/support/hooks.rb:281 0.002
Before features/support/hooks.rb:527 0.003
Steps
Given a computer 0.093
And I start Tails from USB drive "__internal" and I login with an administration password 1:4.587
And I update the APT lists using apt 3:9.776
Tor
Tor operation failed (despite retrying 10 times) with
ExecutionFailedInVM: Command failed: echo asdf ! | sudo -S apt --error-on=any update
error code: 100
stdout: Get:1 tor+https://cloudfront.debian.net/debian trixie InRelease [140 kB]
Get:2 tor+https://cloudfront.debian.net/debian-security trixie-security InRelease [43.4 kB]
Get:3 tor+https://deb.torproject.org/torproject.org trixie InRelease [2,814 B]
Get:4 tor+https://cloudfront.debian.net/debian trixie-updates InRelease [47.3 kB]
Get:5 tor+https://cloudfront.debian.net/debian sid InRelease [193 kB]
Get:6 tor+https://deb.torproject.org/torproject.org trixie/main amd64 Packages [2,440 B]
Get:7 tor+https://cloudfront.debian.net/debian trixie-backports InRelease [54.0 kB]
Get:8 tor+https://cloudfront.debian.net/debian trixie/main amd64 Packages [9,678 kB]
Get:9 tor+https://cloudfront.debian.net/debian trixie/main Translation-en [6,486 kB]
Get:10 tor+https://cloudfront.debian.net/debian trixie/contrib amd64 Packages [53.9 kB]
Get:11 tor+https://cloudfront.debian.net/debian trixie/contrib Translation-en [49.6 kB]
Get:12 tor+https://cloudfront.debian.net/debian-security trixie-security/main amd64 Packages [262 kB]
Get:13 tor+https://cloudfront.debian.net/debian-security trixie-security/main Translation-en [160 kB]
Get:14 tor+https://cloudfront.debian.net/debian-security trixie-security/contrib amd64 Packages [3,148 B]
Get:15 tor+https://cloudfront.debian.net/debian-security trixie-security/contrib Translation-en [2,564 B]
Get:16 tor+https://cloudfront.debian.net/debian trixie-updates/main amd64 Packages [4,412 B]
Get:17 tor+https://cloudfront.debian.net/debian trixie-updates/main Translation-en [2,496 B]
Get:18 tor+https://cloudfront.debian.net/debian sid/main amd64 Packages [10.8 MB]
Get:19 tor+https://cloudfront.debian.net/debian sid/main Translation-en [7,733 kB]
Get:20 tor+https://cloudfront.debian.net/debian sid/contrib amd64 Packages [64.4 kB]
Get:21 tor+https://cloudfront.debian.net/debian sid/contrib Translation-en [59.1 kB]
Get:22 tor+https://cloudfront.debian.net/debian trixie-backports/main amd64 Packages [325 kB]
Get:23 tor+https://cloudfront.debian.net/debian trixie-backports/main Translation-en [237 kB]
Get:24 tor+https://cloudfront.debian.net/debian trixie-backports/contrib amd64 Packages [7,976 B]
Get:25 tor+https://cloudfront.debian.net/debian trixie-backports/contrib Translation-en [7,712 B]
Ign:26 tor+https://deb.tails.net stable InRelease
Err:27 tor+https://deb.tails.net stable Release
  SOCKS proxy socks5h://127.0.0.1:9050 could not connect to deb.tails.net (0.0.0.0:0) due to: general SOCKS server failure (1) [IP: 127.0.0.1 9050]
Reading package lists...

stderr: [sudo] password for amnesia: 
WARNING: apt does not have a stable CLI interface. Use with caution in scripts.

Error: The repository 'tor+https://deb.tails.net stable Release' does not have a Release file.

<false> is not true. (MaxRetriesFailure)
./features/support/helpers/misc_helpers.rb:226:in `rescue in block in retry_action'
./features/support/helpers/misc_helpers.rb:209:in `block in retry_action'
<internal:kernel>:187:in `loop'
./features/support/helpers/misc_helpers.rb:208:in `retry_action'
./features/support/helpers/misc_helpers.rb:196:in `retry_tor'
./features/step_definitions/apt.rb:59:in `/^I update the APT lists using apt$/'
features/additional_software_packages.feature:47:in `And I update the APT lists using apt'
When I install "ripgrep" using apt 0.000
Then the Additional Software dpkg hook has been run for package "ripgrep" and notices the persistence is locked 0.000
And the package "ripgrep" is installed 0.000
After features/support/hooks.rb:535 0.033
After features/support/hooks.rb:339 5.316

SCENARIO FAILED: 'The Additional Software dpkg hook notices when persistence is locked down while installing a package' (at time 01:06:46)

Boot log: https://jenkins.tails.net/job/test_Tails_ISO_21565-flatpak-safe/48/artifact/build-artifacts/01:06:46_The_Additional_Software_dpkg_hook_notices_when_persistence_is_locked_down_while_installing_a_package.file_content_var_log_boot.log

Content of /run/live-additional-software/log: https://jenkins.tails.net/job/test_Tails_ISO_21565-flatpak-safe/48/artifact/build-artifacts/01:06:46_The_Additional_Software_dpkg_hook_notices_when_persistence_is_locked_down_while_installing_a_package.file_content_run_live-additional-software_log

Output of ls -la --full-time /live/persistence/tailsdata_unlocked: https://jenkins.tails.net/job/test_Tails_ISO_21565-flatpak-safe/48/artifact/build-artifacts/01:06:46_The_Additional_Software_dpkg_hook_notices_when_persistence_is_locked_down_while_installing_a_package.cmd_output_persistent_volume

Output of ls -lar --full-time /var/cache/apt: https://jenkins.tails.net/job/test_Tails_ISO_21565-flatpak-safe/48/artifact/build-artifacts/01:06:46_The_Additional_Software_dpkg_hook_notices_when_persistence_is_locked_down_while_installing_a_package.cmd_output_var_cache_apt

Output of ls -lar --full-time /var/lib/apt: https://jenkins.tails.net/job/test_Tails_ISO_21565-flatpak-safe/48/artifact/build-artifacts/01:06:46_The_Additional_Software_dpkg_hook_notices_when_persistence_is_locked_down_while_installing_a_package.cmd_output_var_lib_apt

Output of mount: https://jenkins.tails.net/job/test_Tails_ISO_21565-flatpak-safe/48/artifact/build-artifacts/01:06:46_The_Additional_Software_dpkg_hook_notices_when_persistence_is_locked_down_while_installing_a_package.cmd_output_mount

Screenshot: https://jenkins.tails.net/job/test_Tails_ISO_21565-flatpak-safe/48/artifact/build-artifacts/01:06:46_The_Additional_Software_dpkg_hook_notices_when_persistence_is_locked_down_while_installing_a_package.png

Video: https://jenkins.tails.net/job/test_Tails_ISO_21565-flatpak-safe/48/artifact/build-artifacts/01:06:46_The_Additional_Software_dpkg_hook_notices_when_persistence_is_locked_down_while_installing_a_package.mkv

Systemd journal: https://jenkins.tails.net/job/test_Tails_ISO_21565-flatpak-safe/48/artifact/build-artifacts/01:06:46_The_Additional_Software_dpkg_hook_notices_when_persistence_is_locked_down_while_installing_a_package.journal

After features/support/hooks.rb:108 0.034
48.391
Scenario My Additional Software list is configurable through a GUI or through notifications when I install or remove packages with APT or Synaptic
Before features/support/hooks.rb:274 0.000
Before features/support/hooks.rb:281 0.003
Before features/support/hooks.rb:527 0.002
Steps
Given a computer 0.077
And I start Tails from USB drive "__internal" and I login with persistence enabled and an administration password 48.314
The
The Dogtail init script raised: SearchError: descendant of [application | Welcome to Tails!]: child with roleName='password text'
STDOUT:

STDERR:

 (Dogtail::Failure)
./features/support/helpers/dogtail.rb:93:in `run'
./features/support/helpers/dogtail.rb:339:in `initialize'
./features/support/helpers/dogtail.rb:268:in `new'
./features/support/helpers/dogtail.rb:268:in `call_tree_api_method'
./features/support/helpers/dogtail.rb:276:in `child'
./features/step_definitions/usb.rb:698:in `/^I try to enable persistence( with the changed passphrase)?$/'
./features/step_definitions/usb.rb:729:in `/^I enable persistence( with the changed passphrase)?$/'
./features/step_definitions/common_steps.rb:245:in `/^I start Tails from (.+?) drive "(.+?)"( with network unplugged)?( and I login( with persistence enabled)?( with the changed persistence passphrase)?( (?:and|with) an administration password)?)?$/'
features/additional_software_packages.feature:55:in `And I start Tails from USB drive "__internal" and I login with persistence enabled and an administration password'
When I uninstall "popularity-contest" using apt 0.000
And I accept removing "popularity-contest" from Additional Software 0.000
Then "popularity-contest" is not in the list of Additional Software 0.000
When I start Synaptic 0.000
And I update the APT lists using Synaptic 0.000
And I install "cowsay" using Synaptic 0.000
And I accept adding "cowsay" to Additional Software 0.000
Then Additional Software is correctly configured for package "cowsay" 0.000
When I uninstall "cowsay" using apt 0.000
And I refuse removing "cowsay" from Additional Software 0.000
Then Additional Software is correctly configured for package "cowsay" 0.000
When I start "Additional Software" via GNOME Activities Overview 0.000
And I remove "cowsay" from the list of Additional Software using Additional Software GUI 0.000
Then "cowsay" is not in the list of Additional Software 0.000
When I install "cowsay" using apt 0.000
And I refuse adding "cowsay" to Additional Software 0.000
Then "cowsay" is not in the list of Additional Software 0.000
After features/support/hooks.rb:535 0.034
After features/support/hooks.rb:339 5.254

SCENARIO FAILED: 'My Additional Software list is configurable through a GUI or through notifications when I install or remove packages with APT or Synaptic' (at time 01:07:39)

Exception thrown while trying to save /tmp/TailsToaster/artifact.file_content_run_live-additional-software_log: RemoteShell::ServerFailure: FileNotFoundError: [Errno 2] No such file or directory: '/run/live-additional-software/log'

Boot log: https://jenkins.tails.net/job/test_Tails_ISO_21565-flatpak-safe/48/artifact/build-artifacts/01:07:39_My_Additional_Software_list_is_configurable_through_a_GUI_or_through_notifications_when_I_install_or_remove_packages_with_APT_or_Synaptic.file_content_var_log_boot.log

Output of ls -la --full-time /live/persistence/tailsdata_unlocked: https://jenkins.tails.net/job/test_Tails_ISO_21565-flatpak-safe/48/artifact/build-artifacts/01:07:39_My_Additional_Software_list_is_configurable_through_a_GUI_or_through_notifications_when_I_install_or_remove_packages_with_APT_or_Synaptic.cmd_output_persistent_volume

Output of ls -lar --full-time /var/cache/apt: https://jenkins.tails.net/job/test_Tails_ISO_21565-flatpak-safe/48/artifact/build-artifacts/01:07:39_My_Additional_Software_list_is_configurable_through_a_GUI_or_through_notifications_when_I_install_or_remove_packages_with_APT_or_Synaptic.cmd_output_var_cache_apt

Output of ls -lar --full-time /var/lib/apt: https://jenkins.tails.net/job/test_Tails_ISO_21565-flatpak-safe/48/artifact/build-artifacts/01:07:39_My_Additional_Software_list_is_configurable_through_a_GUI_or_through_notifications_when_I_install_or_remove_packages_with_APT_or_Synaptic.cmd_output_var_lib_apt

Output of mount: https://jenkins.tails.net/job/test_Tails_ISO_21565-flatpak-safe/48/artifact/build-artifacts/01:07:39_My_Additional_Software_list_is_configurable_through_a_GUI_or_through_notifications_when_I_install_or_remove_packages_with_APT_or_Synaptic.cmd_output_mount

Screenshot: https://jenkins.tails.net/job/test_Tails_ISO_21565-flatpak-safe/48/artifact/build-artifacts/01:07:39_My_Additional_Software_list_is_configurable_through_a_GUI_or_through_notifications_when_I_install_or_remove_packages_with_APT_or_Synaptic.png

Video: https://jenkins.tails.net/job/test_Tails_ISO_21565-flatpak-safe/48/artifact/build-artifacts/01:07:39_My_Additional_Software_list_is_configurable_through_a_GUI_or_through_notifications_when_I_install_or_remove_packages_with_APT_or_Synaptic.mkv

Systemd journal: https://jenkins.tails.net/job/test_Tails_ISO_21565-flatpak-safe/48/artifact/build-artifacts/01:07:39_My_Additional_Software_list_is_configurable_through_a_GUI_or_through_notifications_when_I_install_or_remove_packages_with_APT_or_Synaptic.journal

After features/support/hooks.rb:108 0.006
48.607
Scenario Recovering in offline mode after Additional Software previously failed to upgrade and then succeed to upgrade when online
Before features/support/hooks.rb:274 0.000
Before features/support/hooks.rb:281 0.002
Before features/support/hooks.rb:527 0.002
Steps
Given a computer 0.092
And I start Tails from USB drive "__internal" and I login with persistence enabled and an administration password 48.515
The
The Dogtail init script raised: SearchError: descendant of [application | Welcome to Tails!]: child with roleName='password text'
STDOUT:

STDERR:

 (Dogtail::Failure)
./features/support/helpers/dogtail.rb:93:in `run'
./features/support/helpers/dogtail.rb:339:in `initialize'
./features/support/helpers/dogtail.rb:268:in `new'
./features/support/helpers/dogtail.rb:268:in `call_tree_api_method'
./features/support/helpers/dogtail.rb:276:in `child'
./features/step_definitions/usb.rb:698:in `/^I try to enable persistence( with the changed passphrase)?$/'
./features/step_definitions/usb.rb:729:in `/^I enable persistence( with the changed passphrase)?$/'
./features/step_definitions/common_steps.rb:245:in `/^I start Tails from (.+?) drive "(.+?)"( with network unplugged)?( and I login( with persistence enabled)?( with the changed persistence passphrase)?( (?:and|with) an administration password)?)?$/'
features/additional_software_packages.feature:79:in `And I start Tails from USB drive "__internal" and I login with persistence enabled and an administration password'
And I configure APT to prefer an old version of cowsay 0.000
When I install an old version "3.03+dfsg2-1" of the cowsay package using apt 0.000
And I accept adding "cowsay" to Additional Software 0.000
And Additional Software is correctly configured for package "cowsay" 0.000
And I shutdown Tails and wait for the computer to power off 0.000
And I start Tails from USB drive "__internal" with network unplugged 0.000
And I enable persistence 0.000
# We need to add back this custom APT source for the Additional Software
# install step, as it was not saved in persistence
And I configure APT to prefer an old version of cowsay 0.000
# Prevent the "Warning: virtual machine detected!" notification from racing
# with the one we'll be interacting with below.
And I disable the tails-virt-notify-user.service user unit 0.000
And I log in to a new session 0.000
And the installed version of package "cowsay" is "3.03+dfsg2-1" after Additional Software has been installed 0.000
And I revert the APT tweaks that made it prefer an old version of cowsay 0.000
# We remove the newest package after it has been downloaded and before
# it is installed, so that the upgrade process fails
And I prepare the Additional Software upgrade process to fail 0.000
And the network is plugged 0.000
And Tor is ready 0.000
And available upgrades have been checked 0.000
And I see the "The upgrade of your additional software failed" notification after at most 300 seconds 0.000
And I can open the Additional Software configuration window from the notification 0.000
And I shutdown Tails and wait for the computer to power off 0.000
And I start Tails from USB drive "__internal" with network unplugged 0.000
And I enable persistence 0.000
# We need to add back this custom APT source for the Additional Software
# install step, as it was not saved in persistence
And I configure APT to prefer an old version of cowsay 0.000
And I log in to a new session 0.000
And the installed version of package "cowsay" is "3.03+dfsg2-1" after Additional Software has been installed 0.000
And I revert the APT tweaks that made it prefer an old version of cowsay 0.000
And the network is plugged 0.000
And Tor is ready 0.000
Then the Additional Software upgrade service has started 0.000
And the installed version of package "cowsay" is newer than "3.03+dfsg2-1" 0.000
After features/support/hooks.rb:535 0.035
After features/support/hooks.rb:339 5.069

SCENARIO FAILED: 'Recovering in offline mode after Additional Software previously failed to upgrade and then succeed to upgrade when online' (at time 01:08:33)

Exception thrown while trying to save /tmp/TailsToaster/artifact.file_content_run_live-additional-software_log: RemoteShell::ServerFailure: FileNotFoundError: [Errno 2] No such file or directory: '/run/live-additional-software/log'

Boot log: https://jenkins.tails.net/job/test_Tails_ISO_21565-flatpak-safe/48/artifact/build-artifacts/01:08:33_Recovering_in_offline_mode_after_Additional_Software_previously_failed_to_upgrade_and_then_succeed_to_upgrade_when_online.file_content_var_log_boot.log

Output of ls -la --full-time /live/persistence/tailsdata_unlocked: https://jenkins.tails.net/job/test_Tails_ISO_21565-flatpak-safe/48/artifact/build-artifacts/01:08:33_Recovering_in_offline_mode_after_Additional_Software_previously_failed_to_upgrade_and_then_succeed_to_upgrade_when_online.cmd_output_persistent_volume

Output of ls -lar --full-time /var/cache/apt: https://jenkins.tails.net/job/test_Tails_ISO_21565-flatpak-safe/48/artifact/build-artifacts/01:08:33_Recovering_in_offline_mode_after_Additional_Software_previously_failed_to_upgrade_and_then_succeed_to_upgrade_when_online.cmd_output_var_cache_apt

Output of ls -lar --full-time /var/lib/apt: https://jenkins.tails.net/job/test_Tails_ISO_21565-flatpak-safe/48/artifact/build-artifacts/01:08:33_Recovering_in_offline_mode_after_Additional_Software_previously_failed_to_upgrade_and_then_succeed_to_upgrade_when_online.cmd_output_var_lib_apt

Output of mount: https://jenkins.tails.net/job/test_Tails_ISO_21565-flatpak-safe/48/artifact/build-artifacts/01:08:33_Recovering_in_offline_mode_after_Additional_Software_previously_failed_to_upgrade_and_then_succeed_to_upgrade_when_online.cmd_output_mount

Screenshot: https://jenkins.tails.net/job/test_Tails_ISO_21565-flatpak-safe/48/artifact/build-artifacts/01:08:33_Recovering_in_offline_mode_after_Additional_Software_previously_failed_to_upgrade_and_then_succeed_to_upgrade_when_online.png

Video: https://jenkins.tails.net/job/test_Tails_ISO_21565-flatpak-safe/48/artifact/build-artifacts/01:08:33_Recovering_in_offline_mode_after_Additional_Software_previously_failed_to_upgrade_and_then_succeed_to_upgrade_when_online.mkv

Systemd journal: https://jenkins.tails.net/job/test_Tails_ISO_21565-flatpak-safe/48/artifact/build-artifacts/01:08:33_Recovering_in_offline_mode_after_Additional_Software_previously_failed_to_upgrade_and_then_succeed_to_upgrade_when_online.journal

After features/support/hooks.rb:108 0.007
48.833
Scenario I am notified when Additional Software fails to install a package
Before features/support/hooks.rb:274 0.000
Before features/support/hooks.rb:281 0.003
Before features/support/hooks.rb:527 0.005
Steps
Given a computer 0.091
And I start Tails from USB drive "__internal" with network unplugged 35.075
And I enable persistence 13.666
The
The Dogtail init script raised: SearchError: descendant of [application | Welcome to Tails!]: child with roleName='password text'
STDOUT:

STDERR:

 (Dogtail::Failure)
./features/support/helpers/dogtail.rb:93:in `run'
./features/support/helpers/dogtail.rb:339:in `initialize'
./features/support/helpers/dogtail.rb:268:in `new'
./features/support/helpers/dogtail.rb:268:in `call_tree_api_method'
./features/support/helpers/dogtail.rb:276:in `child'
./features/step_definitions/usb.rb:698:in `/^I try to enable persistence( with the changed passphrase)?$/'
./features/step_definitions/usb.rb:729:in `/^I enable persistence( with the changed passphrase)?$/'
features/additional_software_packages.feature:123:in `And I enable persistence'
And I remove the "cowsay" deb files from the APT cache 0.000
And I log in to a new session 0.000
Then I see the "The installation of your additional software failed" notification after at most 300 seconds 0.000
And I can open the Additional Software log file from the notification 0.000
And the package "cowsay" is not installed 0.000
After features/support/hooks.rb:535 0.037
After features/support/hooks.rb:339 5.232

SCENARIO FAILED: 'I am notified when Additional Software fails to install a package' (at time 01:09:27)

Exception thrown while trying to save /tmp/TailsToaster/artifact.file_content_run_live-additional-software_log: RemoteShell::ServerFailure: FileNotFoundError: [Errno 2] No such file or directory: '/run/live-additional-software/log'

Boot log: https://jenkins.tails.net/job/test_Tails_ISO_21565-flatpak-safe/48/artifact/build-artifacts/01:09:27_I_am_notified_when_Additional_Software_fails_to_install_a_package.file_content_var_log_boot.log

Output of ls -la --full-time /live/persistence/tailsdata_unlocked: https://jenkins.tails.net/job/test_Tails_ISO_21565-flatpak-safe/48/artifact/build-artifacts/01:09:27_I_am_notified_when_Additional_Software_fails_to_install_a_package.cmd_output_persistent_volume

Output of ls -lar --full-time /var/cache/apt: https://jenkins.tails.net/job/test_Tails_ISO_21565-flatpak-safe/48/artifact/build-artifacts/01:09:27_I_am_notified_when_Additional_Software_fails_to_install_a_package.cmd_output_var_cache_apt

Output of ls -lar --full-time /var/lib/apt: https://jenkins.tails.net/job/test_Tails_ISO_21565-flatpak-safe/48/artifact/build-artifacts/01:09:27_I_am_notified_when_Additional_Software_fails_to_install_a_package.cmd_output_var_lib_apt

Output of mount: https://jenkins.tails.net/job/test_Tails_ISO_21565-flatpak-safe/48/artifact/build-artifacts/01:09:27_I_am_notified_when_Additional_Software_fails_to_install_a_package.cmd_output_mount

Screenshot: https://jenkins.tails.net/job/test_Tails_ISO_21565-flatpak-safe/48/artifact/build-artifacts/01:09:27_I_am_notified_when_Additional_Software_fails_to_install_a_package.png

Video: https://jenkins.tails.net/job/test_Tails_ISO_21565-flatpak-safe/48/artifact/build-artifacts/01:09:27_I_am_notified_when_Additional_Software_fails_to_install_a_package.mkv

Systemd journal: https://jenkins.tails.net/job/test_Tails_ISO_21565-flatpak-safe/48/artifact/build-artifacts/01:09:27_I_am_notified_when_Additional_Software_fails_to_install_a_package.journal

After features/support/hooks.rb:108 0.005
29:19.187
Scenario Upgrading an initial Tails installation with an incremental upgrade
Before features/support/hooks.rb:274 0.000
Before features/support/hooks.rb:281 0.006
Steps
Given I have started Tails without network from a USB drive with a persistent partition enabled and logged in 8.418
And no SquashFS delta is installed 0.098
And Tails is fooled to think that version 6.0~testoverlayfs was initially installed 0.199
And Tails is fooled to think it is running version 6.0~testoverlayfs 0.064
And the file system changes introduced in version 6.2~testoverlayfs are not present 0.216
And the file system changes introduced in version 6.3~testoverlayfs are not present 0.368
When the network is plugged 0.036
And Tor is ready 12.723
Then I am proposed to install an incremental upgrade to version 6.2~testoverlayfs 1.556
And I can successfully install the incremental upgrade to version 6.2~testoverlayfs 28:55.505
Tor
Tor operation failed (despite retrying 10 times) with
FindFailed: can not find any of the patterns ["TailsUpgraderDownloadComplete.png", "TailsUpgraderFailure.png"] on the screen (MaxRetriesFailure)
./features/support/helpers/misc_helpers.rb:226:in `rescue in block in retry_action'
./features/support/helpers/misc_helpers.rb:209:in `block in retry_action'
<internal:kernel>:187:in `loop'
./features/support/helpers/misc_helpers.rb:208:in `retry_action'
./features/support/helpers/misc_helpers.rb:196:in `retry_tor'
./features/step_definitions/usb.rb:1362:in `/^I can successfully install the incremental upgrade to version (.+)$/'
features/usb_upgrade.feature:91:in `And I can successfully install the incremental upgrade to version 6.2~testoverlayfs'
Given I shutdown Tails and wait for the computer to power off 0.000
When I start Tails from USB drive "__internal" with network unplugged and I login with persistence enabled 0.000
Then Tails is running version 6.2~testoverlayfs 0.000
And all tps features are active 0.000
And the file system changes introduced in version 6.2~testoverlayfs are present 0.000
And only the 6.2~testoverlayfs SquashFS delta is installed 0.000
# Our IUK sets a release date that can make Tor bootstrapping impossible
Given Tails system time is magically synchronized 0.000
# We'll really install Tails_amd64_6.0~testoverlayfs_to_6.3~testoverlayfs.iuk
# but we need some way to force upgrading a second time in a row
# even if only the initially installed version is considered
And Tails is fooled to think that version 6.1~testoverlayfs was initially installed 0.000
When the network is plugged 0.000
And Tor is ready 0.000
Then I am proposed to install an incremental upgrade to version 6.3~testoverlayfs 0.000
And I can successfully install the incremental upgrade to version 6.3~testoverlayfs 0.000
Given I shutdown Tails and wait for the computer to power off 0.000
When I start Tails from USB drive "__internal" with network unplugged and I login with persistence enabled 0.000
Then Tails is running version 6.3~testoverlayfs 0.000
And all tps features are active 0.000
And the file system changes introduced in version 6.3~testoverlayfs are present 0.000
And only the 6.3~testoverlayfs SquashFS delta is installed 0.000
# Regression test for #17425 (i.e. the Upgrader would propose
# upgrading to the version that's already running)
Given Tails system time is magically synchronized 0.000
And Tails is fooled to think that version 6.1~testoverlayfs was initially installed 0.000
When the network is plugged 0.000
And Tor is ready 0.000
Then the Upgrader considers the system as up-to-date 0.000
# Regression test on #8158 (i.e. the IUK's filesystem is not part of the Unsafe Browser's chroot)
And I successfully start the Unsafe Browser 0.000
And the file system changes introduced in version 6.3~testoverlayfs are present in the Unsafe Browser's chroot 0.000
After features/support/hooks.rb:339 5.031

SCENARIO FAILED: 'Upgrading an initial Tails installation with an incremental upgrade' (at time 01:46:45)

Boot log: https://jenkins.tails.net/job/test_Tails_ISO_21565-flatpak-safe/48/artifact/build-artifacts/01:46:45_Upgrading_an_initial_Tails_installation_with_an_incremental_upgrade.file_content_var_log_boot.log

Screenshot: https://jenkins.tails.net/job/test_Tails_ISO_21565-flatpak-safe/48/artifact/build-artifacts/01:46:45_Upgrading_an_initial_Tails_installation_with_an_incremental_upgrade.png

Video: https://jenkins.tails.net/job/test_Tails_ISO_21565-flatpak-safe/48/artifact/build-artifacts/01:46:45_Upgrading_an_initial_Tails_installation_with_an_incremental_upgrade.mkv

Systemd journal: https://jenkins.tails.net/job/test_Tails_ISO_21565-flatpak-safe/48/artifact/build-artifacts/01:46:45_Upgrading_an_initial_Tails_installation_with_an_incremental_upgrade.journal

After features/support/hooks.rb:108 0.000
5:26.435
Scenario Tails shuts down on DVD boot medium removal
Before features/support/hooks.rb:274 0.000
Before features/support/hooks.rb:281 0.003
Steps
Given I have started Tails from DVD and logged in and the network is connected 5:26.435
try_for() timeout expired (Timeout::Error)
./features/support/helpers/misc_helpers.rb:145:in `rescue in try_for'
./features/support/helpers/misc_helpers.rb:51:in `try_for'
./features/step_definitions/common_steps.rb:764:in `/^available upgrades have been checked$/'
./features/step_definitions/snapshots.rb:206:in `block in reach_checkpoint'
./features/step_definitions/snapshots.rb:203:in `each'
./features/step_definitions/snapshots.rb:203:in `reach_checkpoint'
./features/step_definitions/snapshots.rb:226:in `/^I\ have\ started\ Tails\ from\ DVD\ and\ logged\ in\ and\ the\ network\ is\ connected$/'
features/emergency_shutdown.feature:12:in `Given I have started Tails from DVD and logged in and the network is connected'
When I eject the boot medium 0.000
Then Tails eventually shuts down 0.000
After features/support/hooks.rb:339 4.958

SCENARIO FAILED: 'Tails shuts down on DVD boot medium removal' (at time 01:52:46)

Boot log: https://jenkins.tails.net/job/test_Tails_ISO_21565-flatpak-safe/48/artifact/build-artifacts/01:52:46_Tails_shuts_down_on_DVD_boot_medium_removal.file_content_var_log_boot.log

Screenshot: https://jenkins.tails.net/job/test_Tails_ISO_21565-flatpak-safe/48/artifact/build-artifacts/01:52:46_Tails_shuts_down_on_DVD_boot_medium_removal.png

Video: https://jenkins.tails.net/job/test_Tails_ISO_21565-flatpak-safe/48/artifact/build-artifacts/01:52:46_Tails_shuts_down_on_DVD_boot_medium_removal.mkv

Systemd journal: https://jenkins.tails.net/job/test_Tails_ISO_21565-flatpak-safe/48/artifact/build-artifacts/01:52:46_Tails_shuts_down_on_DVD_boot_medium_removal.journal

After features/support/hooks.rb:108 0.000
Tags: @source
3.366
Scenario build from an untagged stable branch with no encoded time-based snapshot
Before features/support/hooks.rb:274 0.000
Before features/support/hooks.rb:552 0.000
Steps
Given I am working on the stable base branch 0.034
And Tails 0.10 has been released 0.010
And the last versions mentioned in debian/changelog are 0.10 and 1.0 0.123
And Tails 1.0 has not been released yet 0.000
And no frozen APT snapshot is encoded in config/APT_snapshots.d 0.000
When I successfully run "apt-snapshots-serials prepare-build" 3.196
apt-snapshots-serials prepare-build failed. Exit code: pid 106488 exit 4 (StandardError)
/var/lib/jenkins/workspace/test_Tails_ISO_21565-flatpak-safe/features/step_definitions/build.rb:103:in `/^I successfully run "?([[:alnum:] -]+)"?$/'
features/build.feature:33:in `When I successfully run "apt-snapshots-serials prepare-build"'
And I run "apt-mirror debian" 0.000
Then it should fail 0.000
When I run "apt-mirror torproject" 0.000
Then it should fail 0.000
When I successfully run "apt-mirror debian-security" 0.000
Then I should see a time-based snapshot 0.000
After features/support/hooks.rb:559 0.001
After features/support/hooks.rb:108 0.000
Tags: @source
3.063
Scenario build from an untagged stable branch with encoded time-based snapshots
Before features/support/hooks.rb:274 0.000
Before features/support/hooks.rb:552 0.000
Steps
Given I am working on the stable base branch 0.025
And Tails 0.10 has been released 0.034
And the last versions mentioned in debian/changelog are 0.10 and 1.0 0.083
And Tails 1.0 has not been released yet 0.000
And frozen APT snapshots are encoded in config/APT_snapshots.d 0.000
When I successfully run "apt-snapshots-serials prepare-build" 2.919
apt-snapshots-serials prepare-build failed. Exit code: pid 106527 exit 4 (StandardError)
/var/lib/jenkins/workspace/test_Tails_ISO_21565-flatpak-safe/features/step_definitions/build.rb:103:in `/^I successfully run "?([[:alnum:] -]+)"?$/'
features/build.feature:47:in `When I successfully run "apt-snapshots-serials prepare-build"'
And I successfully run "apt-mirror debian" 0.000
Then I should see a time-based snapshot 0.000
When I successfully run "apt-mirror torproject" 0.000
Then I should see a time-based snapshot 0.000
When I successfully run "apt-mirror debian-security" 0.000
Then I should see a time-based snapshot 0.000
After features/support/hooks.rb:559 0.002
After features/support/hooks.rb:108 0.000
Tags: @source
2.792
Scenario build from a tagged stable branch with no encoded time-based snapshot
Before features/support/hooks.rb:274 0.000
Before features/support/hooks.rb:552 0.000
Steps
Given I am working on the stable base branch 0.070
And Tails 0.10 has been released 0.010
And the last version mentioned in debian/changelog is 0.10 0.031
And no frozen APT snapshot is encoded in config/APT_snapshots.d 0.000
And I checkout the 0.10 tag 0.003
When I successfully run "apt-snapshots-serials prepare-build" 2.676
apt-snapshots-serials prepare-build failed. Exit code: pid 106661 exit 4 (StandardError)
/var/lib/jenkins/workspace/test_Tails_ISO_21565-flatpak-safe/features/step_definitions/build.rb:103:in `/^I successfully run "?([[:alnum:] -]+)"?$/'
features/build.feature:79:in `When I successfully run "apt-snapshots-serials prepare-build"'
And I run "apt-mirror debian" 0.000
Then it should fail 0.000
When I run "apt-mirror torproject" 0.000
Then it should fail 0.000
When I successfully run "apt-mirror debian-security" 0.000
Then I should see the 0.10 tagged snapshot 0.000
After features/support/hooks.rb:559 0.001
After features/support/hooks.rb:108 0.000
Tags: @source
3.056
Scenario build from a tagged stable branch with encoded time-based snapshots
Before features/support/hooks.rb:274 0.000
Before features/support/hooks.rb:552 0.000
Steps
Given I am working on the stable base branch 0.059
And Tails 0.10 has been released 0.024
And the last version mentioned in debian/changelog is 0.10 0.026
And frozen APT snapshots are encoded in config/APT_snapshots.d 0.000
And I checkout the 0.10 tag 0.006
When I successfully run "apt-snapshots-serials prepare-build" 2.940
apt-snapshots-serials prepare-build failed. Exit code: pid 106694 exit 4 (StandardError)
/var/lib/jenkins/workspace/test_Tails_ISO_21565-flatpak-safe/features/step_definitions/build.rb:103:in `/^I successfully run "?([[:alnum:] -]+)"?$/'
features/build.feature:93:in `When I successfully run "apt-snapshots-serials prepare-build"'
And I successfully run "apt-mirror debian" 0.000
Then I should see the 0.10 tagged snapshot 0.000
When I successfully run "apt-mirror torproject" 0.000
Then I should see the 0.10 tagged snapshot 0.000
When I successfully run "apt-mirror debian-security" 0.000
Then I should see the 0.10 tagged snapshot 0.000
After features/support/hooks.rb:559 0.001
After features/support/hooks.rb:108 0.000
Tags: @source
2.783
Scenario build from a bugfix branch with no encoded time-based snapshot for a stable release
Before features/support/hooks.rb:274 0.000
Before features/support/hooks.rb:552 0.000
Steps
Given Tails 0.10 has been released 0.043
And the last version mentioned in debian/changelog is 0.10.1 0.054
And Tails 0.10.1 has not been released yet 0.000
And I am working on the bugfix/disable_gdomap branch based on stable 0.005
And no frozen APT snapshot is encoded in config/APT_snapshots.d 0.000
When I successfully run "apt-snapshots-serials prepare-build" 2.679
apt-snapshots-serials prepare-build failed. Exit code: pid 106847 exit 4 (StandardError)
/var/lib/jenkins/workspace/test_Tails_ISO_21565-flatpak-safe/features/step_definitions/build.rb:103:in `/^I successfully run "?([[:alnum:] -]+)"?$/'
features/build.feature:129:in `When I successfully run "apt-snapshots-serials prepare-build"'
And I run "apt-mirror debian" 0.000
Then it should fail 0.000
When I run "apt-mirror torproject" 0.000
Then it should fail 0.000
When I successfully run "apt-mirror debian-security" 0.000
Then I should see a time-based snapshot 0.000
After features/support/hooks.rb:559 0.001
After features/support/hooks.rb:108 0.000
Tags: @source
3.067
Scenario build from a bugfix branch with encoded time-based snapshots for a stable release
Before features/support/hooks.rb:274 0.000
Before features/support/hooks.rb:552 0.000
Steps
Given Tails 0.10 has been released 0.035
And the last version mentioned in debian/changelog is 0.10.1 0.071
And Tails 0.10.1 has not been released yet 0.000
And I am working on the bugfix/disable_gdomap branch based on stable 0.005
And frozen APT snapshots are encoded in config/APT_snapshots.d 0.000
When I successfully run "apt-snapshots-serials prepare-build" 2.955
apt-snapshots-serials prepare-build failed. Exit code: pid 106886 exit 4 (StandardError)
/var/lib/jenkins/workspace/test_Tails_ISO_21565-flatpak-safe/features/step_definitions/build.rb:103:in `/^I successfully run "?([[:alnum:] -]+)"?$/'
features/build.feature:143:in `When I successfully run "apt-snapshots-serials prepare-build"'
And I successfully run "apt-mirror debian" 0.000
Then I should see a time-based snapshot 0.000
When I successfully run "apt-mirror torproject" 0.000
Then I should see a time-based snapshot 0.000
When I successfully run "apt-mirror debian-security" 0.000
Then I should see a time-based snapshot 0.000
After features/support/hooks.rb:559 0.001
After features/support/hooks.rb:108 0.000
Tags: @source
2.639
Scenario build from an untagged testing branch with no encoded time-based snapshot
Before features/support/hooks.rb:274 0.000
Before features/support/hooks.rb:552 0.000
Steps
Given I am working on the testing base branch 0.028
And Tails 0.10 has been released 0.017
And the last versions mentioned in debian/changelog are 0.10 and 1.0 0.080
And Tails 1.0 has not been released yet 0.000
And no frozen APT snapshot is encoded in config/APT_snapshots.d 0.000
When I successfully run "apt-snapshots-serials prepare-build" 2.512
apt-snapshots-serials prepare-build failed. Exit code: pid 107032 exit 4 (StandardError)
/var/lib/jenkins/workspace/test_Tails_ISO_21565-flatpak-safe/features/step_definitions/build.rb:103:in `/^I successfully run "?([[:alnum:] -]+)"?$/'
features/build.feature:180:in `When I successfully run "apt-snapshots-serials prepare-build"'
And I run "apt-mirror debian" 0.000
Then it should fail 0.000
When I run "apt-mirror torproject" 0.000
Then it should fail 0.000
When I successfully run "apt-mirror debian-security" 0.000
Then I should see a time-based snapshot 0.000
After features/support/hooks.rb:559 0.001
After features/support/hooks.rb:108 0.000
Tags: @source
3.058
Scenario build from an untagged testing branch with encoded time-based snapshots
Before features/support/hooks.rb:274 0.000
Before features/support/hooks.rb:552 0.000
Steps
Given I am working on the testing base branch 0.048
And Tails 0.10 has been released 0.014
And the last versions mentioned in debian/changelog are 0.10 and 1.0 0.081
And Tails 1.0 has not been released yet 0.000
And frozen APT snapshots are encoded in config/APT_snapshots.d 0.000
When I successfully run "apt-snapshots-serials prepare-build" 2.914
apt-snapshots-serials prepare-build failed. Exit code: pid 107078 exit 4 (StandardError)
/var/lib/jenkins/workspace/test_Tails_ISO_21565-flatpak-safe/features/step_definitions/build.rb:103:in `/^I successfully run "?([[:alnum:] -]+)"?$/'
features/build.feature:194:in `When I successfully run "apt-snapshots-serials prepare-build"'
And I successfully run "apt-mirror debian" 0.000
Then I should see a time-based snapshot 0.000
When I successfully run "apt-mirror torproject" 0.000
Then I should see a time-based snapshot 0.000
When I successfully run "apt-mirror debian-security" 0.000
Then I should see a time-based snapshot 0.000
After features/support/hooks.rb:559 0.001
After features/support/hooks.rb:108 0.000
Tags: @source
2.734
Scenario build from a tagged testing branch with no encoded time-based snapshot
Before features/support/hooks.rb:274 0.000
Before features/support/hooks.rb:552 0.000
Steps
Given I am working on the testing base branch 0.029
And the last version mentioned in debian/changelog is 0.11 0.061
And Tails 0.11 has been released 0.025
And no frozen APT snapshot is encoded in config/APT_snapshots.d 0.000
And I checkout the 0.11 tag 0.001
When I successfully run "apt-snapshots-serials prepare-build" 2.615
apt-snapshots-serials prepare-build failed. Exit code: pid 107251 exit 4 (StandardError)
/var/lib/jenkins/workspace/test_Tails_ISO_21565-flatpak-safe/features/step_definitions/build.rb:103:in `/^I successfully run "?([[:alnum:] -]+)"?$/'
features/build.feature:226:in `When I successfully run "apt-snapshots-serials prepare-build"'
And I run "apt-mirror debian" 0.000
Then it should fail 0.000
When I run "apt-mirror torproject" 0.000
Then it should fail 0.000
When I successfully run "apt-mirror debian-security" 0.000
Then I should see the 0.11 tagged snapshot 0.000
After features/support/hooks.rb:559 0.001
After features/support/hooks.rb:108 0.000
Tags: @source
3.052
Scenario build from a tagged testing branch with encoded time-based snapshots
Before features/support/hooks.rb:274 0.000
Before features/support/hooks.rb:552 0.000
Steps
Given I am working on the testing base branch 1.069
And the last version mentioned in debian/changelog is 0.11 0.061
And Tails 0.11 has been released 0.530
And frozen APT snapshots are encoded in config/APT_snapshots.d 0.000
And I checkout the 0.11 tag 0.002
When I successfully run "apt-snapshots-serials prepare-build" 1.388
apt-snapshots-serials prepare-build failed. Exit code: pid 107297 exit 4 (StandardError)
/var/lib/jenkins/workspace/test_Tails_ISO_21565-flatpak-safe/features/step_definitions/build.rb:103:in `/^I successfully run "?([[:alnum:] -]+)"?$/'
features/build.feature:240:in `When I successfully run "apt-snapshots-serials prepare-build"'
And I successfully run "apt-mirror debian" 0.000
Then I should see the 0.11 tagged snapshot 0.000
When I successfully run "apt-mirror torproject" 0.000
Then I should see the 0.11 tagged snapshot 0.000
When I successfully run "apt-mirror debian-security" 0.000
Then I should see the 0.11 tagged snapshot 0.000
After features/support/hooks.rb:559 0.001
After features/support/hooks.rb:108 0.000
Tags: @source
2.723
Scenario build from a bugfix branch with no encoded time-based snapshot for a major release
Before features/support/hooks.rb:274 0.000
Before features/support/hooks.rb:552 0.000
Steps
Given I am working on the testing base branch 0.030
And Tails 0.10~rc1 has been released 0.014
And the last versions mentioned in debian/changelog are 0.10~rc1 and 0.10 0.094
And Tails 0.10 has not been released yet 0.000
And I am working on the bugfix/disable_gdomap branch based on testing 0.014
And no frozen APT snapshot is encoded in config/APT_snapshots.d 0.000
When I successfully run "apt-snapshots-serials prepare-build" 2.568
apt-snapshots-serials prepare-build failed. Exit code: pid 107477 exit 4 (StandardError)
/var/lib/jenkins/workspace/test_Tails_ISO_21565-flatpak-safe/features/step_definitions/build.rb:103:in `/^I successfully run "?([[:alnum:] -]+)"?$/'
features/build.feature:275:in `When I successfully run "apt-snapshots-serials prepare-build"'
And I run "apt-mirror debian" 0.000
Then it should fail 0.000
When I run "apt-mirror torproject" 0.000
Then it should fail 0.000
When I successfully run "apt-mirror debian-security" 0.000
Then I should see a time-based snapshot 0.000
After features/support/hooks.rb:559 0.001
After features/support/hooks.rb:108 0.000
Tags: @source
3.055
Scenario build from a bugfix branch with encoded time-based snapshots for a major release
Before features/support/hooks.rb:274 0.000
Before features/support/hooks.rb:552 0.000
Steps
Given I am working on the testing base branch 0.104
And Tails 0.10~rc1 has been released 0.089
And the last versions mentioned in debian/changelog are 0.10~rc1 and 0.10 0.091
And Tails 0.10 has not been released yet 0.000
And I am working on the bugfix/disable_gdomap branch based on testing 0.005
And frozen APT snapshots are encoded in config/APT_snapshots.d 0.000
When I successfully run "apt-snapshots-serials prepare-build" 2.764
apt-snapshots-serials prepare-build failed. Exit code: pid 107526 exit 4 (StandardError)
/var/lib/jenkins/workspace/test_Tails_ISO_21565-flatpak-safe/features/step_definitions/build.rb:103:in `/^I successfully run "?([[:alnum:] -]+)"?$/'
features/build.feature:290:in `When I successfully run "apt-snapshots-serials prepare-build"'
And I successfully run "apt-mirror debian" 0.000
Then I should see a time-based snapshot 0.000
When I successfully run "apt-mirror torproject" 0.000
Then I should see a time-based snapshot 0.000
When I successfully run "apt-mirror debian-security" 0.000
Then I should see a time-based snapshot 0.000
After features/support/hooks.rb:559 0.001
After features/support/hooks.rb:108 0.000
Tags: @source
2.949
Scenario build from the devel branch with no encoded time-based snapshot
Before features/support/hooks.rb:274 0.000
Before features/support/hooks.rb:552 0.000
Steps
Given I am working on the devel base branch 0.027
And no frozen APT snapshot is encoded in config/APT_snapshots.d 0.000
When I successfully run "apt-snapshots-serials prepare-build" 2.921
apt-snapshots-serials prepare-build failed. Exit code: pid 107645 exit 4 (StandardError)
/var/lib/jenkins/workspace/test_Tails_ISO_21565-flatpak-safe/features/step_definitions/build.rb:103:in `/^I successfully run "?([[:alnum:] -]+)"?$/'
features/build.feature:316:in `When I successfully run "apt-snapshots-serials prepare-build"'
And I successfully run "apt-mirror debian" 0.000
Then I should see a time-based snapshot 0.000
When I successfully run "apt-mirror torproject" 0.000
Then I should see a time-based snapshot 0.000
When I successfully run "apt-mirror debian-security" 0.000
Then I should see a time-based snapshot 0.000
After features/support/hooks.rb:559 0.001
After features/support/hooks.rb:108 0.000
Tags: @source
3.058
Scenario build from the devel branch with encoded time-based snapshots
Before features/support/hooks.rb:274 0.000
Before features/support/hooks.rb:552 0.000
Steps
Given I am working on the devel base branch 0.101
And frozen APT snapshots are encoded in config/APT_snapshots.d 0.000
When I successfully run "apt-snapshots-serials prepare-build" 2.957
apt-snapshots-serials prepare-build failed. Exit code: pid 107671 exit 4 (StandardError)
/var/lib/jenkins/workspace/test_Tails_ISO_21565-flatpak-safe/features/step_definitions/build.rb:103:in `/^I successfully run "?([[:alnum:] -]+)"?$/'
features/build.feature:327:in `When I successfully run "apt-snapshots-serials prepare-build"'
And I run "apt-mirror debian" 0.000
Then it should fail 0.000
When I run "apt-mirror torproject" 0.000
Then it should fail 0.000
When I successfully run "apt-mirror debian-security" 0.000
Then I should see a time-based snapshot 0.000
After features/support/hooks.rb:559 0.000
After features/support/hooks.rb:108 0.000
Tags: @source
2.760
Scenario build from a feature branch based on devel with no encoded time-based snapshot
Before features/support/hooks.rb:274 0.000
Before features/support/hooks.rb:552 0.000
Steps
Given I am working on the feature/thunderbird branch based on devel 0.034
And no frozen APT snapshot is encoded in config/APT_snapshots.d 0.000
When I successfully run "apt-snapshots-serials prepare-build" 2.726
apt-snapshots-serials prepare-build failed. Exit code: pid 107868 exit 4 (StandardError)
/var/lib/jenkins/workspace/test_Tails_ISO_21565-flatpak-safe/features/step_definitions/build.rb:103:in `/^I successfully run "?([[:alnum:] -]+)"?$/'
features/build.feature:366:in `When I successfully run "apt-snapshots-serials prepare-build"'
And I successfully run "apt-mirror debian" 0.000
Then I should see a time-based snapshot 0.000
When I successfully run "apt-mirror torproject" 0.000
Then I should see a time-based snapshot 0.000
When I successfully run "apt-mirror debian-security" 0.000
Then I should see a time-based snapshot 0.000
After features/support/hooks.rb:559 0.003
After features/support/hooks.rb:108 0.000
Tags: @source
3.060
Scenario build from a feature branch based on devel with encoded time-based snapshots
Before features/support/hooks.rb:274 0.000
Before features/support/hooks.rb:552 0.000
Steps
Given I am working on the feature/thunderbird branch based on devel 0.032
And frozen APT snapshots are encoded in config/APT_snapshots.d 0.000
When I successfully run "apt-snapshots-serials prepare-build" 3.028
apt-snapshots-serials prepare-build failed. Exit code: pid 107893 exit 4 (StandardError)
/var/lib/jenkins/workspace/test_Tails_ISO_21565-flatpak-safe/features/step_definitions/build.rb:103:in `/^I successfully run "?([[:alnum:] -]+)"?$/'
features/build.feature:377:in `When I successfully run "apt-snapshots-serials prepare-build"'
And I run "apt-mirror debian" 0.000
Then it should fail 0.000
When I run "apt-mirror torproject" 0.000
Then it should fail 0.000
When I successfully run "apt-mirror debian-security" 0.000
Then I should see a time-based snapshot 0.000
After features/support/hooks.rb:559 0.000
After features/support/hooks.rb:108 0.000
Tags: @product @doc
35.878
Scenario Anti test: Detecting TCP leaks from the Unsafe Browser with the firewall leak detector
Before features/support/hooks.rb:274 0.000
Before features/support/hooks.rb:281 0.002
Steps
Given I have started Tails from DVD and logged in and the network is connected 9.824
And I capture all network traffic 0.004
When I successfully start the Unsafe Browser 6.553
And I open the Tails homepage in the Unsafe Browser 6.530
And the Tails homepage loads in the Unsafe Browser 12.964
The
The Dogtail init script raised: SearchError: descendant of [application | Firefox]: child with name='Tails' roleName='document web'
STDOUT:

STDERR:

 (Dogtail::Failure)
./features/support/helpers/dogtail.rb:93:in `run'
./features/support/helpers/dogtail.rb:339:in `initialize'
./features/support/helpers/dogtail.rb:268:in `new'
./features/support/helpers/dogtail.rb:268:in `call_tree_api_method'
./features/support/helpers/dogtail.rb:276:in `child'
./features/step_definitions/browser.rb:379:in `headings_in_page'
./features/step_definitions/browser.rb:383:in `page_has_heading'
./features/step_definitions/unsafe_browser.rb:141:in `/^the Tails homepage loads in the Unsafe Browser$/'
features/tor_enforcement.feature:21:in `And the Tails homepage loads in the Unsafe Browser'
Then the firewall leak detector has detected leaks 0.000
After features/support/hooks.rb:339 5.304

SCENARIO FAILED: 'Anti test: Detecting TCP leaks from the Unsafe Browser with the firewall leak detector' (at time 03:41:31)

Boot log: https://jenkins.tails.net/job/test_Tails_ISO_21565-flatpak-safe/48/artifact/build-artifacts/03:41:31_Anti_test:_Detecting_TCP_leaks_from_the_Unsafe_Browser_with_the_firewall_leak_detector.file_content_var_log_boot.log

Screenshot: https://jenkins.tails.net/job/test_Tails_ISO_21565-flatpak-safe/48/artifact/build-artifacts/03:41:31_Anti_test:_Detecting_TCP_leaks_from_the_Unsafe_Browser_with_the_firewall_leak_detector.png

Video: https://jenkins.tails.net/job/test_Tails_ISO_21565-flatpak-safe/48/artifact/build-artifacts/03:41:31_Anti_test:_Detecting_TCP_leaks_from_the_Unsafe_Browser_with_the_firewall_leak_detector.mkv

Systemd journal: https://jenkins.tails.net/job/test_Tails_ISO_21565-flatpak-safe/48/artifact/build-artifacts/03:41:31_Anti_test:_Detecting_TCP_leaks_from_the_Unsafe_Browser_with_the_firewall_leak_detector.journal

After features/support/hooks.rb:108 0.052
20:0.042
Scenario tails-upgrade-frontend-wrapper is using the Tails-specific SocksPort
Steps
When I monitor the network connections of tails-upgrade-frontend-wrapper 0.037
And I re-run tails-upgrade-frontend-wrapper 20:0.005
execution expired (RemoteShell::Timeout)
./features/support/helpers/remote_shell.rb:56:in `read'
./features/support/helpers/remote_shell.rb:56:in `block (3 levels) in communicate'
./features/support/helpers/remote_shell.rb:55:in `block (2 levels) in communicate'
<internal:kernel>:187:in `loop'
./features/support/helpers/remote_shell.rb:42:in `block in communicate'
./features/support/helpers/remote_shell.rb:37:in `communicate'
./features/support/helpers/remote_shell.rb:124:in `execute'
./features/support/helpers/remote_shell.rb:135:in `initialize'
./features/support/helpers/vm_helper.rb:486:in `new'
./features/support/helpers/vm_helper.rb:486:in `execute'
./features/support/helpers/vm_helper.rb:492:in `execute_successfully'
./features/step_definitions/tor.rb:400:in `/^I re-run tails-upgrade-frontend-wrapper$/'
features/tor_stream_isolation.feature:24:in `And I re-run tails-upgrade-frontend-wrapper'
Then I see that tails-upgrade-frontend-wrapper is properly stream isolated 0.000
After features/support/hooks.rb:535 0.035
After features/support/hooks.rb:339 10.793

SCENARIO FAILED: 'tails-upgrade-frontend-wrapper is using the Tails-specific SocksPort' (at time 04:03:40)

Screenshot: https://jenkins.tails.net/job/test_Tails_ISO_21565-flatpak-safe/48/artifact/build-artifacts/04:03:40_tails-upgrade-frontend-wrapper_is_using_the_Tails-specific_SocksPort.png

Video: https://jenkins.tails.net/job/test_Tails_ISO_21565-flatpak-safe/48/artifact/build-artifacts/04:03:40_tails-upgrade-frontend-wrapper_is_using_the_Tails-specific_SocksPort.mkv

Systemd journal: https://jenkins.tails.net/job/test_Tails_ISO_21565-flatpak-safe/48/artifact/build-artifacts/04:03:40_tails-upgrade-frontend-wrapper_is_using_the_Tails-specific_SocksPort.journal

After features/support/hooks.rb:108 0.000
Tags: @product
3:58.338
Scenario Persistent browser bookmarks
Before features/support/hooks.rb:274 0.000
Before features/support/hooks.rb:281 0.013
Steps
Given I have started Tails without network from a USB drive with a persistent partition enabled and logged in 8.024
And all tps features are active 8.069
And all persistent filesystems have safe access rights 0.146
And all persistence configuration files have safe access rights 0.266
And all persistent directories have safe access rights 1.636
When I start the Tor Browser in offline mode 13.641
And I add a bookmark to eff.org in the Tor Browser 7.840
And I cold reboot the computer 6.334
And the computer reboots Tails 33.400
And I enable persistence 13.635
And I log in to a new session 7.821
And all notifications have disappeared 8.252
And I start the Tor Browser in offline mode 2:9.269
try_for() timeout expired
Last ignored exception was: FindFailed: can still find TorBrowserStopButton.png on the screen
./features/support/helpers/screen.rb:207:in `rescue in wait_vanish'
./features/support/helpers/screen.rb:192:in `wait_vanish'
./features/step_definitions/browser.rb:522:in `block (2 levels) in <top (required)>'
./features/support/helpers/misc_helpers.rb:78:in `block (2 levels) in try_for'
<internal:kernel>:187:in `loop'
./features/support/helpers/misc_helpers.rb:66:in `block in try_for'
./features/support/helpers/misc_helpers.rb:65:in `try_for'
./features/step_definitions/browser.rb:518:in `block in <top (required)>'
./features/step_definitions/browser.rb:507:in `block in <top (required)>' (Timeout::Error)
./features/support/helpers/misc_helpers.rb:145:in `rescue in try_for'
./features/support/helpers/misc_helpers.rb:51:in `try_for'
./features/step_definitions/browser.rb:518:in `/^the Tor Browser (?:has started|starts)$/'
./features/step_definitions/browser.rb:507:in `/^I start the Tor Browser( in offline mode)?$/'
features/torified_browsing.feature:142:in `And I start the Tor Browser in offline mode'
Then the Tor Browser has a bookmark to eff.org 0.000
After features/support/hooks.rb:339 4.939

SCENARIO FAILED: 'Persistent browser bookmarks' (at time 04:18:19)

Boot log: https://jenkins.tails.net/job/test_Tails_ISO_21565-flatpak-safe/48/artifact/build-artifacts/04:18:19_Persistent_browser_bookmarks.file_content_var_log_boot.log

Screenshot: https://jenkins.tails.net/job/test_Tails_ISO_21565-flatpak-safe/48/artifact/build-artifacts/04:18:19_Persistent_browser_bookmarks.png

Video: https://jenkins.tails.net/job/test_Tails_ISO_21565-flatpak-safe/48/artifact/build-artifacts/04:18:19_Persistent_browser_bookmarks.mkv

Systemd journal: https://jenkins.tails.net/job/test_Tails_ISO_21565-flatpak-safe/48/artifact/build-artifacts/04:18:19_Persistent_browser_bookmarks.journal

After features/support/hooks.rb:108 0.006
Tags: @product @doc
36.175
Scenario The Unsafe Browser can load a web page from the Internet
Before features/support/hooks.rb:274 0.000
Before features/support/hooks.rb:281 0.002
Steps
Given I have started Tails from DVD and logged in and the network is connected 9.894
When I successfully start the Unsafe Browser 6.158
When I open the Tails homepage in the Unsafe Browser 7.145
Then the Tails homepage loads in the Unsafe Browser 12.976
The
The Dogtail init script raised: SearchError: descendant of [application | Firefox]: child with name='Tails' roleName='document web'
STDOUT:

STDERR:

 (Dogtail::Failure)
./features/support/helpers/dogtail.rb:93:in `run'
./features/support/helpers/dogtail.rb:339:in `initialize'
./features/support/helpers/dogtail.rb:268:in `new'
./features/support/helpers/dogtail.rb:268:in `call_tree_api_method'
./features/support/helpers/dogtail.rb:276:in `child'
./features/step_definitions/browser.rb:379:in `headings_in_page'
./features/step_definitions/browser.rb:383:in `page_has_heading'
./features/step_definitions/unsafe_browser.rb:141:in `/^the Tails homepage loads in the Unsafe Browser$/'
features/unsafe_browser.feature:39:in `Then the Tails homepage loads in the Unsafe Browser'
And the Unsafe Browser has sent packets out to the Internet 0.000
After features/support/hooks.rb:339 5.100

SCENARIO FAILED: 'The Unsafe Browser can load a web page from the Internet' (at time 04:23:16)

Boot log: https://jenkins.tails.net/job/test_Tails_ISO_21565-flatpak-safe/48/artifact/build-artifacts/04:23:16_The_Unsafe_Browser_can_load_a_web_page_from_the_Internet.file_content_var_log_boot.log

Screenshot: https://jenkins.tails.net/job/test_Tails_ISO_21565-flatpak-safe/48/artifact/build-artifacts/04:23:16_The_Unsafe_Browser_can_load_a_web_page_from_the_Internet.png

Video: https://jenkins.tails.net/job/test_Tails_ISO_21565-flatpak-safe/48/artifact/build-artifacts/04:23:16_The_Unsafe_Browser_can_load_a_web_page_from_the_Internet.mkv

Systemd journal: https://jenkins.tails.net/job/test_Tails_ISO_21565-flatpak-safe/48/artifact/build-artifacts/04:23:16_The_Unsafe_Browser_can_load_a_web_page_from_the_Internet.journal

After features/support/hooks.rb:108 0.000