Project Number Date
test_Tails_ISO_21565-flatpak-safe 47 23 Sep 2026, 16:09

Failures Overview

The following summary displays scenarios that failed.

5:48.432
Scenario I set up Additional Software when installing a package without persistent partition and the package is installed next time I start Tails
Before features/support/hooks.rb:274 0.000
Before features/support/hooks.rb:281 0.002
Before features/support/hooks.rb:527 0.011
Steps
Given I start Tails from a freshly installed USB drive with an administration password and the network is plugged and I login 5:48.432
try_for() timeout expired (Timeout::Error)
./features/support/helpers/misc_helpers.rb:145:in `rescue in try_for'
./features/support/helpers/misc_helpers.rb:51:in `try_for'
./features/step_definitions/common_steps.rb:764:in `/^available upgrades have been checked$/'
./features/step_definitions/common_steps.rb:273:in `/^I start Tails from a freshly installed USB drive with an administration password and the network is plugged and I login$/'
features/additional_software_packages.feature:28:in `Given I start Tails from a freshly installed USB drive with an administration password and the network is plugged and I login'
And I update the APT lists using apt 0.000
And I install "popularity-contest" using apt 0.000
Then I am proposed to add the "popularity-contest" package to my Additional Software 0.000
When I create a persistent storage and activate the Additional Software feature 0.000
Then Additional Software is correctly configured for package "popularity-contest" 0.000
When I shutdown Tails and wait for the computer to power off 0.000
And I start Tails from USB drive "__internal" with network unplugged 0.000
And I enable persistence 0.000
And I log in to a new session 0.000
And the Additional Software installation service has started 0.000
Then I am notified that the installation succeeded 0.000
And Additional Software is correctly configured for package "popularity-contest" 0.000
And the package "popularity-contest" is installed after Additional Software has been installed 0.000
After features/support/hooks.rb:535 0.039
After features/support/hooks.rb:339 5.146

SCENARIO FAILED: 'I set up Additional Software when installing a package without persistent partition and the package is installed next time I start Tails' (at time 01:01:58)

Boot log: https://jenkins.tails.net/job/test_Tails_ISO_21565-flatpak-safe/47/artifact/build-artifacts/01:01:58_I_set_up_Additional_Software_when_installing_a_package_without_persistent_partition_and_the_package_is_installed_next_time_I_start_Tails.file_content_var_log_boot.log

Content of /run/live-additional-software/log: https://jenkins.tails.net/job/test_Tails_ISO_21565-flatpak-safe/47/artifact/build-artifacts/01:01:58_I_set_up_Additional_Software_when_installing_a_package_without_persistent_partition_and_the_package_is_installed_next_time_I_start_Tails.file_content_run_live-additional-software_log

Output of ls -la --full-time /live/persistence/tailsdata_unlocked: https://jenkins.tails.net/job/test_Tails_ISO_21565-flatpak-safe/47/artifact/build-artifacts/01:01:58_I_set_up_Additional_Software_when_installing_a_package_without_persistent_partition_and_the_package_is_installed_next_time_I_start_Tails.cmd_output_persistent_volume

Output of ls -lar --full-time /var/cache/apt: https://jenkins.tails.net/job/test_Tails_ISO_21565-flatpak-safe/47/artifact/build-artifacts/01:01:58_I_set_up_Additional_Software_when_installing_a_package_without_persistent_partition_and_the_package_is_installed_next_time_I_start_Tails.cmd_output_var_cache_apt

Output of ls -lar --full-time /var/lib/apt: https://jenkins.tails.net/job/test_Tails_ISO_21565-flatpak-safe/47/artifact/build-artifacts/01:01:58_I_set_up_Additional_Software_when_installing_a_package_without_persistent_partition_and_the_package_is_installed_next_time_I_start_Tails.cmd_output_var_lib_apt

Output of mount: https://jenkins.tails.net/job/test_Tails_ISO_21565-flatpak-safe/47/artifact/build-artifacts/01:01:58_I_set_up_Additional_Software_when_installing_a_package_without_persistent_partition_and_the_package_is_installed_next_time_I_start_Tails.cmd_output_mount

Screenshot: https://jenkins.tails.net/job/test_Tails_ISO_21565-flatpak-safe/47/artifact/build-artifacts/01:01:58_I_set_up_Additional_Software_when_installing_a_package_without_persistent_partition_and_the_package_is_installed_next_time_I_start_Tails.png

Video: https://jenkins.tails.net/job/test_Tails_ISO_21565-flatpak-safe/47/artifact/build-artifacts/01:01:58_I_set_up_Additional_Software_when_installing_a_package_without_persistent_partition_and_the_package_is_installed_next_time_I_start_Tails.mkv

Systemd journal: https://jenkins.tails.net/job/test_Tails_ISO_21565-flatpak-safe/47/artifact/build-artifacts/01:01:58_I_set_up_Additional_Software_when_installing_a_package_without_persistent_partition_and_the_package_is_installed_next_time_I_start_Tails.journal

After features/support/hooks.rb:108 0.000
4:17.683
Scenario The Additional Software dpkg hook notices when persistence is locked down while installing a package
Before features/support/hooks.rb:274 0.000
Before features/support/hooks.rb:281 0.002
Before features/support/hooks.rb:527 0.002
Steps
Given a computer 0.083
And I start Tails from USB drive "__internal" and I login with an administration password 1:3.685
And I update the APT lists using apt 3:13.913
Tor
Tor operation failed (despite retrying 10 times) with
ExecutionFailedInVM: Command failed: echo asdf ! | sudo -S apt --error-on=any update
error code: 100
stdout: Get:1 tor+https://cloudfront.debian.net/debian trixie InRelease [140 kB]
Get:2 tor+https://cloudfront.debian.net/debian-security trixie-security InRelease [43.4 kB]
Get:3 tor+https://cloudfront.debian.net/debian trixie-updates InRelease [47.3 kB]
Get:4 tor+https://cloudfront.debian.net/debian sid InRelease [193 kB]
Get:5 tor+https://cloudfront.debian.net/debian trixie-backports InRelease [54.0 kB]
Get:6 tor+https://cloudfront.debian.net/debian trixie/main amd64 Packages [9,678 kB]
Get:7 tor+https://cloudfront.debian.net/debian trixie/main Translation-en [6,486 kB]
Get:8 tor+https://deb.torproject.org/torproject.org trixie InRelease [2,814 B]
Get:9 tor+https://cloudfront.debian.net/debian trixie/contrib amd64 Packages [53.9 kB]
Get:10 tor+https://cloudfront.debian.net/debian trixie/contrib Translation-en [49.6 kB]
Get:11 tor+https://cloudfront.debian.net/debian-security trixie-security/main amd64 Packages [262 kB]
Get:12 tor+https://cloudfront.debian.net/debian-security trixie-security/main Translation-en [160 kB]
Get:13 tor+https://cloudfront.debian.net/debian-security trixie-security/contrib amd64 Packages [3,148 B]
Get:14 tor+https://cloudfront.debian.net/debian-security trixie-security/contrib Translation-en [2,564 B]
Get:15 tor+https://cloudfront.debian.net/debian trixie-updates/main amd64 Packages [4,412 B]
Get:16 tor+https://cloudfront.debian.net/debian trixie-updates/main Translation-en [2,496 B]
Get:17 tor+https://cloudfront.debian.net/debian sid/main amd64 Packages [10.8 MB]
Get:18 tor+https://deb.torproject.org/torproject.org trixie/main amd64 Packages [2,440 B]
Get:19 tor+https://cloudfront.debian.net/debian sid/main Translation-en [7,733 kB]
Get:20 tor+https://cloudfront.debian.net/debian sid/contrib amd64 Packages [64.4 kB]
Get:21 tor+https://cloudfront.debian.net/debian sid/contrib Translation-en [59.1 kB]
Get:22 tor+https://cloudfront.debian.net/debian trixie-backports/main amd64 Packages [325 kB]
Get:23 tor+https://cloudfront.debian.net/debian trixie-backports/main Translation-en [237 kB]
Get:24 tor+https://cloudfront.debian.net/debian trixie-backports/contrib amd64 Packages [7,976 B]
Get:25 tor+https://cloudfront.debian.net/debian trixie-backports/contrib Translation-en [7,712 B]
Ign:26 tor+https://deb.tails.net stable InRelease
Err:27 tor+https://deb.tails.net stable Release
  SOCKS proxy socks5h://127.0.0.1:9050 could not connect to deb.tails.net (0.0.0.0:0) due to: general SOCKS server failure (1) [IP: 127.0.0.1 9050]
Reading package lists...

stderr: [sudo] password for amnesia: 
WARNING: apt does not have a stable CLI interface. Use with caution in scripts.

Error: The repository 'tor+https://deb.tails.net stable Release' does not have a Release file.

<false> is not true. (MaxRetriesFailure)
./features/support/helpers/misc_helpers.rb:226:in `rescue in block in retry_action'
./features/support/helpers/misc_helpers.rb:209:in `block in retry_action'
<internal:kernel>:187:in `loop'
./features/support/helpers/misc_helpers.rb:208:in `retry_action'
./features/support/helpers/misc_helpers.rb:196:in `retry_tor'
./features/step_definitions/apt.rb:59:in `/^I update the APT lists using apt$/'
features/additional_software_packages.feature:47:in `And I update the APT lists using apt'
When I install "ripgrep" using apt 0.000
Then the Additional Software dpkg hook has been run for package "ripgrep" and notices the persistence is locked 0.000
And the package "ripgrep" is installed 0.000
After features/support/hooks.rb:535 0.028
After features/support/hooks.rb:339 4.994

SCENARIO FAILED: 'The Additional Software dpkg hook notices when persistence is locked down while installing a package' (at time 01:06:21)

Boot log: https://jenkins.tails.net/job/test_Tails_ISO_21565-flatpak-safe/47/artifact/build-artifacts/01:06:21_The_Additional_Software_dpkg_hook_notices_when_persistence_is_locked_down_while_installing_a_package.file_content_var_log_boot.log

Content of /run/live-additional-software/log: https://jenkins.tails.net/job/test_Tails_ISO_21565-flatpak-safe/47/artifact/build-artifacts/01:06:21_The_Additional_Software_dpkg_hook_notices_when_persistence_is_locked_down_while_installing_a_package.file_content_run_live-additional-software_log

Output of ls -la --full-time /live/persistence/tailsdata_unlocked: https://jenkins.tails.net/job/test_Tails_ISO_21565-flatpak-safe/47/artifact/build-artifacts/01:06:21_The_Additional_Software_dpkg_hook_notices_when_persistence_is_locked_down_while_installing_a_package.cmd_output_persistent_volume

Output of ls -lar --full-time /var/cache/apt: https://jenkins.tails.net/job/test_Tails_ISO_21565-flatpak-safe/47/artifact/build-artifacts/01:06:21_The_Additional_Software_dpkg_hook_notices_when_persistence_is_locked_down_while_installing_a_package.cmd_output_var_cache_apt

Output of ls -lar --full-time /var/lib/apt: https://jenkins.tails.net/job/test_Tails_ISO_21565-flatpak-safe/47/artifact/build-artifacts/01:06:21_The_Additional_Software_dpkg_hook_notices_when_persistence_is_locked_down_while_installing_a_package.cmd_output_var_lib_apt

Output of mount: https://jenkins.tails.net/job/test_Tails_ISO_21565-flatpak-safe/47/artifact/build-artifacts/01:06:21_The_Additional_Software_dpkg_hook_notices_when_persistence_is_locked_down_while_installing_a_package.cmd_output_mount

Screenshot: https://jenkins.tails.net/job/test_Tails_ISO_21565-flatpak-safe/47/artifact/build-artifacts/01:06:21_The_Additional_Software_dpkg_hook_notices_when_persistence_is_locked_down_while_installing_a_package.png

Video: https://jenkins.tails.net/job/test_Tails_ISO_21565-flatpak-safe/47/artifact/build-artifacts/01:06:21_The_Additional_Software_dpkg_hook_notices_when_persistence_is_locked_down_while_installing_a_package.mkv

Systemd journal: https://jenkins.tails.net/job/test_Tails_ISO_21565-flatpak-safe/47/artifact/build-artifacts/01:06:21_The_Additional_Software_dpkg_hook_notices_when_persistence_is_locked_down_while_installing_a_package.journal

After features/support/hooks.rb:108 0.038
47.346
Scenario My Additional Software list is configurable through a GUI or through notifications when I install or remove packages with APT or Synaptic
Before features/support/hooks.rb:274 0.000
Before features/support/hooks.rb:281 0.001
Before features/support/hooks.rb:527 0.002
Steps
Given a computer 0.134
And I start Tails from USB drive "__internal" and I login with persistence enabled and an administration password 47.211
The
The Dogtail init script raised: SearchError: descendant of [application | Welcome to Tails!]: child with roleName='password text'
STDOUT:

STDERR:

 (Dogtail::Failure)
./features/support/helpers/dogtail.rb:93:in `run'
./features/support/helpers/dogtail.rb:339:in `initialize'
./features/support/helpers/dogtail.rb:268:in `new'
./features/support/helpers/dogtail.rb:268:in `call_tree_api_method'
./features/support/helpers/dogtail.rb:276:in `child'
./features/step_definitions/usb.rb:698:in `/^I try to enable persistence( with the changed passphrase)?$/'
./features/step_definitions/usb.rb:729:in `/^I enable persistence( with the changed passphrase)?$/'
./features/step_definitions/common_steps.rb:245:in `/^I start Tails from (.+?) drive "(.+?)"( with network unplugged)?( and I login( with persistence enabled)?( with the changed persistence passphrase)?( (?:and|with) an administration password)?)?$/'
features/additional_software_packages.feature:55:in `And I start Tails from USB drive "__internal" and I login with persistence enabled and an administration password'
When I uninstall "popularity-contest" using apt 0.000
And I accept removing "popularity-contest" from Additional Software 0.000
Then "popularity-contest" is not in the list of Additional Software 0.000
When I start Synaptic 0.000
And I update the APT lists using Synaptic 0.000
And I install "cowsay" using Synaptic 0.000
And I accept adding "cowsay" to Additional Software 0.000
Then Additional Software is correctly configured for package "cowsay" 0.000
When I uninstall "cowsay" using apt 0.000
And I refuse removing "cowsay" from Additional Software 0.000
Then Additional Software is correctly configured for package "cowsay" 0.000
When I start "Additional Software" via GNOME Activities Overview 0.000
And I remove "cowsay" from the list of Additional Software using Additional Software GUI 0.000
Then "cowsay" is not in the list of Additional Software 0.000
When I install "cowsay" using apt 0.000
And I refuse adding "cowsay" to Additional Software 0.000
Then "cowsay" is not in the list of Additional Software 0.000
After features/support/hooks.rb:535 0.049
After features/support/hooks.rb:339 5.320

SCENARIO FAILED: 'My Additional Software list is configurable through a GUI or through notifications when I install or remove packages with APT or Synaptic' (at time 01:07:14)

Exception thrown while trying to save /tmp/TailsToaster/artifact.file_content_run_live-additional-software_log: RemoteShell::ServerFailure: FileNotFoundError: [Errno 2] No such file or directory: '/run/live-additional-software/log'

Boot log: https://jenkins.tails.net/job/test_Tails_ISO_21565-flatpak-safe/47/artifact/build-artifacts/01:07:14_My_Additional_Software_list_is_configurable_through_a_GUI_or_through_notifications_when_I_install_or_remove_packages_with_APT_or_Synaptic.file_content_var_log_boot.log

Output of ls -la --full-time /live/persistence/tailsdata_unlocked: https://jenkins.tails.net/job/test_Tails_ISO_21565-flatpak-safe/47/artifact/build-artifacts/01:07:14_My_Additional_Software_list_is_configurable_through_a_GUI_or_through_notifications_when_I_install_or_remove_packages_with_APT_or_Synaptic.cmd_output_persistent_volume

Output of ls -lar --full-time /var/cache/apt: https://jenkins.tails.net/job/test_Tails_ISO_21565-flatpak-safe/47/artifact/build-artifacts/01:07:14_My_Additional_Software_list_is_configurable_through_a_GUI_or_through_notifications_when_I_install_or_remove_packages_with_APT_or_Synaptic.cmd_output_var_cache_apt

Output of ls -lar --full-time /var/lib/apt: https://jenkins.tails.net/job/test_Tails_ISO_21565-flatpak-safe/47/artifact/build-artifacts/01:07:14_My_Additional_Software_list_is_configurable_through_a_GUI_or_through_notifications_when_I_install_or_remove_packages_with_APT_or_Synaptic.cmd_output_var_lib_apt

Output of mount: https://jenkins.tails.net/job/test_Tails_ISO_21565-flatpak-safe/47/artifact/build-artifacts/01:07:14_My_Additional_Software_list_is_configurable_through_a_GUI_or_through_notifications_when_I_install_or_remove_packages_with_APT_or_Synaptic.cmd_output_mount

Screenshot: https://jenkins.tails.net/job/test_Tails_ISO_21565-flatpak-safe/47/artifact/build-artifacts/01:07:14_My_Additional_Software_list_is_configurable_through_a_GUI_or_through_notifications_when_I_install_or_remove_packages_with_APT_or_Synaptic.png

Video: https://jenkins.tails.net/job/test_Tails_ISO_21565-flatpak-safe/47/artifact/build-artifacts/01:07:14_My_Additional_Software_list_is_configurable_through_a_GUI_or_through_notifications_when_I_install_or_remove_packages_with_APT_or_Synaptic.mkv

Systemd journal: https://jenkins.tails.net/job/test_Tails_ISO_21565-flatpak-safe/47/artifact/build-artifacts/01:07:14_My_Additional_Software_list_is_configurable_through_a_GUI_or_through_notifications_when_I_install_or_remove_packages_with_APT_or_Synaptic.journal

After features/support/hooks.rb:108 0.011
47.191
Scenario Recovering in offline mode after Additional Software previously failed to upgrade and then succeed to upgrade when online
Before features/support/hooks.rb:274 0.000
Before features/support/hooks.rb:281 0.002
Before features/support/hooks.rb:527 0.002
Steps
Given a computer 0.100
And I start Tails from USB drive "__internal" and I login with persistence enabled and an administration password 47.091
The
The Dogtail init script raised: SearchError: descendant of [application | Welcome to Tails!]: child with roleName='password text'
STDOUT:

STDERR:

 (Dogtail::Failure)
./features/support/helpers/dogtail.rb:93:in `run'
./features/support/helpers/dogtail.rb:339:in `initialize'
./features/support/helpers/dogtail.rb:268:in `new'
./features/support/helpers/dogtail.rb:268:in `call_tree_api_method'
./features/support/helpers/dogtail.rb:276:in `child'
./features/step_definitions/usb.rb:698:in `/^I try to enable persistence( with the changed passphrase)?$/'
./features/step_definitions/usb.rb:729:in `/^I enable persistence( with the changed passphrase)?$/'
./features/step_definitions/common_steps.rb:245:in `/^I start Tails from (.+?) drive "(.+?)"( with network unplugged)?( and I login( with persistence enabled)?( with the changed persistence passphrase)?( (?:and|with) an administration password)?)?$/'
features/additional_software_packages.feature:79:in `And I start Tails from USB drive "__internal" and I login with persistence enabled and an administration password'
And I configure APT to prefer an old version of cowsay 0.000
When I install an old version "3.03+dfsg2-1" of the cowsay package using apt 0.000
And I accept adding "cowsay" to Additional Software 0.000
And Additional Software is correctly configured for package "cowsay" 0.000
And I shutdown Tails and wait for the computer to power off 0.000
And I start Tails from USB drive "__internal" with network unplugged 0.000
And I enable persistence 0.000
# We need to add back this custom APT source for the Additional Software
# install step, as it was not saved in persistence
And I configure APT to prefer an old version of cowsay 0.000
# Prevent the "Warning: virtual machine detected!" notification from racing
# with the one we'll be interacting with below.
And I disable the tails-virt-notify-user.service user unit 0.000
And I log in to a new session 0.000
And the installed version of package "cowsay" is "3.03+dfsg2-1" after Additional Software has been installed 0.000
And I revert the APT tweaks that made it prefer an old version of cowsay 0.000
# We remove the newest package after it has been downloaded and before
# it is installed, so that the upgrade process fails
And I prepare the Additional Software upgrade process to fail 0.000
And the network is plugged 0.000
And Tor is ready 0.000
And available upgrades have been checked 0.000
And I see the "The upgrade of your additional software failed" notification after at most 300 seconds 0.000
And I can open the Additional Software configuration window from the notification 0.000
And I shutdown Tails and wait for the computer to power off 0.000
And I start Tails from USB drive "__internal" with network unplugged 0.000
And I enable persistence 0.000
# We need to add back this custom APT source for the Additional Software
# install step, as it was not saved in persistence
And I configure APT to prefer an old version of cowsay 0.000
And I log in to a new session 0.000
And the installed version of package "cowsay" is "3.03+dfsg2-1" after Additional Software has been installed 0.000
And I revert the APT tweaks that made it prefer an old version of cowsay 0.000
And the network is plugged 0.000
And Tor is ready 0.000
Then the Additional Software upgrade service has started 0.000
And the installed version of package "cowsay" is newer than "3.03+dfsg2-1" 0.000
After features/support/hooks.rb:535 0.032
After features/support/hooks.rb:339 5.436

SCENARIO FAILED: 'Recovering in offline mode after Additional Software previously failed to upgrade and then succeed to upgrade when online' (at time 01:08:06)

Exception thrown while trying to save /tmp/TailsToaster/artifact.file_content_run_live-additional-software_log: RemoteShell::ServerFailure: FileNotFoundError: [Errno 2] No such file or directory: '/run/live-additional-software/log'

Boot log: https://jenkins.tails.net/job/test_Tails_ISO_21565-flatpak-safe/47/artifact/build-artifacts/01:08:06_Recovering_in_offline_mode_after_Additional_Software_previously_failed_to_upgrade_and_then_succeed_to_upgrade_when_online.file_content_var_log_boot.log

Output of ls -la --full-time /live/persistence/tailsdata_unlocked: https://jenkins.tails.net/job/test_Tails_ISO_21565-flatpak-safe/47/artifact/build-artifacts/01:08:06_Recovering_in_offline_mode_after_Additional_Software_previously_failed_to_upgrade_and_then_succeed_to_upgrade_when_online.cmd_output_persistent_volume

Output of ls -lar --full-time /var/cache/apt: https://jenkins.tails.net/job/test_Tails_ISO_21565-flatpak-safe/47/artifact/build-artifacts/01:08:06_Recovering_in_offline_mode_after_Additional_Software_previously_failed_to_upgrade_and_then_succeed_to_upgrade_when_online.cmd_output_var_cache_apt

Output of ls -lar --full-time /var/lib/apt: https://jenkins.tails.net/job/test_Tails_ISO_21565-flatpak-safe/47/artifact/build-artifacts/01:08:06_Recovering_in_offline_mode_after_Additional_Software_previously_failed_to_upgrade_and_then_succeed_to_upgrade_when_online.cmd_output_var_lib_apt

Output of mount: https://jenkins.tails.net/job/test_Tails_ISO_21565-flatpak-safe/47/artifact/build-artifacts/01:08:06_Recovering_in_offline_mode_after_Additional_Software_previously_failed_to_upgrade_and_then_succeed_to_upgrade_when_online.cmd_output_mount

Screenshot: https://jenkins.tails.net/job/test_Tails_ISO_21565-flatpak-safe/47/artifact/build-artifacts/01:08:06_Recovering_in_offline_mode_after_Additional_Software_previously_failed_to_upgrade_and_then_succeed_to_upgrade_when_online.png

Video: https://jenkins.tails.net/job/test_Tails_ISO_21565-flatpak-safe/47/artifact/build-artifacts/01:08:06_Recovering_in_offline_mode_after_Additional_Software_previously_failed_to_upgrade_and_then_succeed_to_upgrade_when_online.mkv

Systemd journal: https://jenkins.tails.net/job/test_Tails_ISO_21565-flatpak-safe/47/artifact/build-artifacts/01:08:06_Recovering_in_offline_mode_after_Additional_Software_previously_failed_to_upgrade_and_then_succeed_to_upgrade_when_online.journal

After features/support/hooks.rb:108 0.005
48.071
Scenario I am notified when Additional Software fails to install a package
Before features/support/hooks.rb:274 0.000
Before features/support/hooks.rb:281 0.001
Before features/support/hooks.rb:527 0.001
Steps
Given a computer 0.083
And I start Tails from USB drive "__internal" with network unplugged 34.220
And I enable persistence 13.767
The
The Dogtail init script raised: SearchError: descendant of [application | Welcome to Tails!]: child with roleName='password text'
STDOUT:

STDERR:

 (Dogtail::Failure)
./features/support/helpers/dogtail.rb:93:in `run'
./features/support/helpers/dogtail.rb:339:in `initialize'
./features/support/helpers/dogtail.rb:268:in `new'
./features/support/helpers/dogtail.rb:268:in `call_tree_api_method'
./features/support/helpers/dogtail.rb:276:in `child'
./features/step_definitions/usb.rb:698:in `/^I try to enable persistence( with the changed passphrase)?$/'
./features/step_definitions/usb.rb:729:in `/^I enable persistence( with the changed passphrase)?$/'
features/additional_software_packages.feature:123:in `And I enable persistence'
And I remove the "cowsay" deb files from the APT cache 0.000
And I log in to a new session 0.000
Then I see the "The installation of your additional software failed" notification after at most 300 seconds 0.000
And I can open the Additional Software log file from the notification 0.000
And the package "cowsay" is not installed 0.000
After features/support/hooks.rb:535 0.061
After features/support/hooks.rb:339 5.025

SCENARIO FAILED: 'I am notified when Additional Software fails to install a package' (at time 01:09:00)

Exception thrown while trying to save /tmp/TailsToaster/artifact.file_content_run_live-additional-software_log: RemoteShell::ServerFailure: FileNotFoundError: [Errno 2] No such file or directory: '/run/live-additional-software/log'

Boot log: https://jenkins.tails.net/job/test_Tails_ISO_21565-flatpak-safe/47/artifact/build-artifacts/01:09:00_I_am_notified_when_Additional_Software_fails_to_install_a_package.file_content_var_log_boot.log

Output of ls -la --full-time /live/persistence/tailsdata_unlocked: https://jenkins.tails.net/job/test_Tails_ISO_21565-flatpak-safe/47/artifact/build-artifacts/01:09:00_I_am_notified_when_Additional_Software_fails_to_install_a_package.cmd_output_persistent_volume

Output of ls -lar --full-time /var/cache/apt: https://jenkins.tails.net/job/test_Tails_ISO_21565-flatpak-safe/47/artifact/build-artifacts/01:09:00_I_am_notified_when_Additional_Software_fails_to_install_a_package.cmd_output_var_cache_apt

Output of ls -lar --full-time /var/lib/apt: https://jenkins.tails.net/job/test_Tails_ISO_21565-flatpak-safe/47/artifact/build-artifacts/01:09:00_I_am_notified_when_Additional_Software_fails_to_install_a_package.cmd_output_var_lib_apt

Output of mount: https://jenkins.tails.net/job/test_Tails_ISO_21565-flatpak-safe/47/artifact/build-artifacts/01:09:00_I_am_notified_when_Additional_Software_fails_to_install_a_package.cmd_output_mount

Screenshot: https://jenkins.tails.net/job/test_Tails_ISO_21565-flatpak-safe/47/artifact/build-artifacts/01:09:00_I_am_notified_when_Additional_Software_fails_to_install_a_package.png

Video: https://jenkins.tails.net/job/test_Tails_ISO_21565-flatpak-safe/47/artifact/build-artifacts/01:09:00_I_am_notified_when_Additional_Software_fails_to_install_a_package.mkv

Systemd journal: https://jenkins.tails.net/job/test_Tails_ISO_21565-flatpak-safe/47/artifact/build-artifacts/01:09:00_I_am_notified_when_Additional_Software_fails_to_install_a_package.journal

After features/support/hooks.rb:108 0.011
40:23.645
Scenario Upgrading an initial Tails installation with an incremental upgrade
Before features/support/hooks.rb:274 0.000
Before features/support/hooks.rb:281 0.001
Steps
Given I have started Tails without network from a USB drive with a persistent partition enabled and logged in 8.382
And no SquashFS delta is installed 0.051
And Tails is fooled to think that version 6.0~testoverlayfs was initially installed 0.214
And Tails is fooled to think it is running version 6.0~testoverlayfs 0.036
And the file system changes introduced in version 6.2~testoverlayfs are not present 0.186
And the file system changes introduced in version 6.3~testoverlayfs are not present 0.407
When the network is plugged 0.033
And Tor is ready 12.033
Then I am proposed to install an incremental upgrade to version 6.2~testoverlayfs 6:34.963
And I can successfully install the incremental upgrade to version 6.2~testoverlayfs 33:27.335
Tor
Tor operation failed (despite retrying 10 times) with
FindFailed: can not find any of the patterns ["TailsUpgraderDownloadComplete.png", "TailsUpgraderFailure.png"] on the screen (MaxRetriesFailure)
./features/support/helpers/misc_helpers.rb:226:in `rescue in block in retry_action'
./features/support/helpers/misc_helpers.rb:209:in `block in retry_action'
<internal:kernel>:187:in `loop'
./features/support/helpers/misc_helpers.rb:208:in `retry_action'
./features/support/helpers/misc_helpers.rb:196:in `retry_tor'
./features/step_definitions/usb.rb:1362:in `/^I can successfully install the incremental upgrade to version (.+)$/'
features/usb_upgrade.feature:91:in `And I can successfully install the incremental upgrade to version 6.2~testoverlayfs'
Given I shutdown Tails and wait for the computer to power off 0.000
When I start Tails from USB drive "__internal" with network unplugged and I login with persistence enabled 0.000
Then Tails is running version 6.2~testoverlayfs 0.000
And all tps features are active 0.000
And the file system changes introduced in version 6.2~testoverlayfs are present 0.000
And only the 6.2~testoverlayfs SquashFS delta is installed 0.000
# Our IUK sets a release date that can make Tor bootstrapping impossible
Given Tails system time is magically synchronized 0.000
# We'll really install Tails_amd64_6.0~testoverlayfs_to_6.3~testoverlayfs.iuk
# but we need some way to force upgrading a second time in a row
# even if only the initially installed version is considered
And Tails is fooled to think that version 6.1~testoverlayfs was initially installed 0.000
When the network is plugged 0.000
And Tor is ready 0.000
Then I am proposed to install an incremental upgrade to version 6.3~testoverlayfs 0.000
And I can successfully install the incremental upgrade to version 6.3~testoverlayfs 0.000
Given I shutdown Tails and wait for the computer to power off 0.000
When I start Tails from USB drive "__internal" with network unplugged and I login with persistence enabled 0.000
Then Tails is running version 6.3~testoverlayfs 0.000
And all tps features are active 0.000
And the file system changes introduced in version 6.3~testoverlayfs are present 0.000
And only the 6.3~testoverlayfs SquashFS delta is installed 0.000
# Regression test for #17425 (i.e. the Upgrader would propose
# upgrading to the version that's already running)
Given Tails system time is magically synchronized 0.000
And Tails is fooled to think that version 6.1~testoverlayfs was initially installed 0.000
When the network is plugged 0.000
And Tor is ready 0.000
Then the Upgrader considers the system as up-to-date 0.000
# Regression test on #8158 (i.e. the IUK's filesystem is not part of the Unsafe Browser's chroot)
And I successfully start the Unsafe Browser 0.000
And the file system changes introduced in version 6.3~testoverlayfs are present in the Unsafe Browser's chroot 0.000
After features/support/hooks.rb:339 5.362

SCENARIO FAILED: 'Upgrading an initial Tails installation with an incremental upgrade' (at time 01:57:10)

Boot log: https://jenkins.tails.net/job/test_Tails_ISO_21565-flatpak-safe/47/artifact/build-artifacts/01:57:10_Upgrading_an_initial_Tails_installation_with_an_incremental_upgrade.file_content_var_log_boot.log

Screenshot: https://jenkins.tails.net/job/test_Tails_ISO_21565-flatpak-safe/47/artifact/build-artifacts/01:57:10_Upgrading_an_initial_Tails_installation_with_an_incremental_upgrade.png

Video: https://jenkins.tails.net/job/test_Tails_ISO_21565-flatpak-safe/47/artifact/build-artifacts/01:57:10_Upgrading_an_initial_Tails_installation_with_an_incremental_upgrade.mkv

Systemd journal: https://jenkins.tails.net/job/test_Tails_ISO_21565-flatpak-safe/47/artifact/build-artifacts/01:57:10_Upgrading_an_initial_Tails_installation_with_an_incremental_upgrade.journal

After features/support/hooks.rb:108 0.000
Tags: @source
6.970
Scenario build from an untagged stable branch with no encoded time-based snapshot
Before features/support/hooks.rb:274 0.000
Before features/support/hooks.rb:552 0.000
Steps
Given I am working on the stable base branch 0.039
And Tails 0.10 has been released 0.013
And the last versions mentioned in debian/changelog are 0.10 and 1.0 0.082
And Tails 1.0 has not been released yet 0.000
And no frozen APT snapshot is encoded in config/APT_snapshots.d 0.000
When I successfully run "apt-snapshots-serials prepare-build" 6.834
apt-snapshots-serials prepare-build failed. Exit code: pid 131131 exit 4 (StandardError)
/var/lib/jenkins/workspace/test_Tails_ISO_21565-flatpak-safe/features/step_definitions/build.rb:103:in `/^I successfully run "?([[:alnum:] -]+)"?$/'
features/build.feature:33:in `When I successfully run "apt-snapshots-serials prepare-build"'
And I run "apt-mirror debian" 0.000
Then it should fail 0.000
When I run "apt-mirror torproject" 0.000
Then it should fail 0.000
When I successfully run "apt-mirror debian-security" 0.000
Then I should see a time-based snapshot 0.000
After features/support/hooks.rb:559 0.001
After features/support/hooks.rb:108 0.000
Tags: @source
3.057
Scenario build from an untagged stable branch with encoded time-based snapshots
Before features/support/hooks.rb:274 0.000
Before features/support/hooks.rb:552 0.000
Steps
Given I am working on the stable base branch 0.029
And Tails 0.10 has been released 0.011
And the last versions mentioned in debian/changelog are 0.10 and 1.0 0.083
And Tails 1.0 has not been released yet 0.000
And frozen APT snapshots are encoded in config/APT_snapshots.d 0.000
When I successfully run "apt-snapshots-serials prepare-build" 2.932
apt-snapshots-serials prepare-build failed. Exit code: pid 131169 exit 4 (StandardError)
/var/lib/jenkins/workspace/test_Tails_ISO_21565-flatpak-safe/features/step_definitions/build.rb:103:in `/^I successfully run "?([[:alnum:] -]+)"?$/'
features/build.feature:47:in `When I successfully run "apt-snapshots-serials prepare-build"'
And I successfully run "apt-mirror debian" 0.000
Then I should see a time-based snapshot 0.000
When I successfully run "apt-mirror torproject" 0.000
Then I should see a time-based snapshot 0.000
When I successfully run "apt-mirror debian-security" 0.000
Then I should see a time-based snapshot 0.000
After features/support/hooks.rb:559 0.001
After features/support/hooks.rb:108 0.000
Tags: @source
2.819
Scenario build from a tagged stable branch with no encoded time-based snapshot
Before features/support/hooks.rb:274 0.000
Before features/support/hooks.rb:552 0.000
Steps
Given I am working on the stable base branch 0.023
And Tails 0.10 has been released 0.009
And the last version mentioned in debian/changelog is 0.10 0.020
And no frozen APT snapshot is encoded in config/APT_snapshots.d 0.000
And I checkout the 0.10 tag 0.002
When I successfully run "apt-snapshots-serials prepare-build" 2.764
apt-snapshots-serials prepare-build failed. Exit code: pid 131303 exit 4 (StandardError)
/var/lib/jenkins/workspace/test_Tails_ISO_21565-flatpak-safe/features/step_definitions/build.rb:103:in `/^I successfully run "?([[:alnum:] -]+)"?$/'
features/build.feature:79:in `When I successfully run "apt-snapshots-serials prepare-build"'
And I run "apt-mirror debian" 0.000
Then it should fail 0.000
When I run "apt-mirror torproject" 0.000
Then it should fail 0.000
When I successfully run "apt-mirror debian-security" 0.000
Then I should see the 0.10 tagged snapshot 0.000
After features/support/hooks.rb:559 0.001
After features/support/hooks.rb:108 0.000
Tags: @source
3.064
Scenario build from a tagged stable branch with encoded time-based snapshots
Before features/support/hooks.rb:274 0.000
Before features/support/hooks.rb:552 0.000
Steps
Given I am working on the stable base branch 0.026
And Tails 0.10 has been released 0.008
And the last version mentioned in debian/changelog is 0.10 0.019
And frozen APT snapshots are encoded in config/APT_snapshots.d 0.000
And I checkout the 0.10 tag 0.002
When I successfully run "apt-snapshots-serials prepare-build" 3.007
apt-snapshots-serials prepare-build failed. Exit code: pid 131336 exit 4 (StandardError)
/var/lib/jenkins/workspace/test_Tails_ISO_21565-flatpak-safe/features/step_definitions/build.rb:103:in `/^I successfully run "?([[:alnum:] -]+)"?$/'
features/build.feature:93:in `When I successfully run "apt-snapshots-serials prepare-build"'
And I successfully run "apt-mirror debian" 0.000
Then I should see the 0.10 tagged snapshot 0.000
When I successfully run "apt-mirror torproject" 0.000
Then I should see the 0.10 tagged snapshot 0.000
When I successfully run "apt-mirror debian-security" 0.000
Then I should see the 0.10 tagged snapshot 0.000
After features/support/hooks.rb:559 0.001
After features/support/hooks.rb:108 0.000
Tags: @source
2.746
Scenario build from a bugfix branch with no encoded time-based snapshot for a stable release
Before features/support/hooks.rb:274 0.000
Before features/support/hooks.rb:552 0.000
Steps
Given Tails 0.10 has been released 0.029
And the last version mentioned in debian/changelog is 0.10.1 0.057
And Tails 0.10.1 has not been released yet 0.000
And I am working on the bugfix/disable_gdomap branch based on stable 0.005
And no frozen APT snapshot is encoded in config/APT_snapshots.d 0.000
When I successfully run "apt-snapshots-serials prepare-build" 2.654
apt-snapshots-serials prepare-build failed. Exit code: pid 131490 exit 4 (StandardError)
/var/lib/jenkins/workspace/test_Tails_ISO_21565-flatpak-safe/features/step_definitions/build.rb:103:in `/^I successfully run "?([[:alnum:] -]+)"?$/'
features/build.feature:129:in `When I successfully run "apt-snapshots-serials prepare-build"'
And I run "apt-mirror debian" 0.000
Then it should fail 0.000
When I run "apt-mirror torproject" 0.000
Then it should fail 0.000
When I successfully run "apt-mirror debian-security" 0.000
Then I should see a time-based snapshot 0.000
After features/support/hooks.rb:559 0.001
After features/support/hooks.rb:108 0.000
Tags: @source
6.126
Scenario build from a bugfix branch with encoded time-based snapshots for a stable release
Before features/support/hooks.rb:274 0.000
Before features/support/hooks.rb:552 0.000
Steps
Given Tails 0.10 has been released 0.035
And the last version mentioned in debian/changelog is 0.10.1 0.063
And Tails 0.10.1 has not been released yet 0.000
And I am working on the bugfix/disable_gdomap branch based on stable 0.005
And frozen APT snapshots are encoded in config/APT_snapshots.d 0.000
When I successfully run "apt-snapshots-serials prepare-build" 6.022
apt-snapshots-serials prepare-build failed. Exit code: pid 131544 exit 4 (StandardError)
/var/lib/jenkins/workspace/test_Tails_ISO_21565-flatpak-safe/features/step_definitions/build.rb:103:in `/^I successfully run "?([[:alnum:] -]+)"?$/'
features/build.feature:143:in `When I successfully run "apt-snapshots-serials prepare-build"'
And I successfully run "apt-mirror debian" 0.000
Then I should see a time-based snapshot 0.000
When I successfully run "apt-mirror torproject" 0.000
Then I should see a time-based snapshot 0.000
When I successfully run "apt-mirror debian-security" 0.000
Then I should see a time-based snapshot 0.000
After features/support/hooks.rb:559 0.001
After features/support/hooks.rb:108 0.000
Tags: @source
2.787
Scenario build from an untagged testing branch with no encoded time-based snapshot
Before features/support/hooks.rb:274 0.000
Before features/support/hooks.rb:552 0.000
Steps
Given I am working on the testing base branch 0.027
And Tails 0.10 has been released 0.015
And the last versions mentioned in debian/changelog are 0.10 and 1.0 0.078
And Tails 1.0 has not been released yet 0.000
And no frozen APT snapshot is encoded in config/APT_snapshots.d 0.000
When I successfully run "apt-snapshots-serials prepare-build" 2.666
apt-snapshots-serials prepare-build failed. Exit code: pid 131690 exit 4 (StandardError)
/var/lib/jenkins/workspace/test_Tails_ISO_21565-flatpak-safe/features/step_definitions/build.rb:103:in `/^I successfully run "?([[:alnum:] -]+)"?$/'
features/build.feature:180:in `When I successfully run "apt-snapshots-serials prepare-build"'
And I run "apt-mirror debian" 0.000
Then it should fail 0.000
When I run "apt-mirror torproject" 0.000
Then it should fail 0.000
When I successfully run "apt-mirror debian-security" 0.000
Then I should see a time-based snapshot 0.000
After features/support/hooks.rb:559 0.001
After features/support/hooks.rb:108 0.000
Tags: @source
3.061
Scenario build from an untagged testing branch with encoded time-based snapshots
Before features/support/hooks.rb:274 0.000
Before features/support/hooks.rb:552 0.000
Steps
Given I am working on the testing base branch 0.042
And Tails 0.10 has been released 0.019
And the last versions mentioned in debian/changelog are 0.10 and 1.0 0.089
And Tails 1.0 has not been released yet 0.000
And frozen APT snapshots are encoded in config/APT_snapshots.d 0.000
When I successfully run "apt-snapshots-serials prepare-build" 2.909
apt-snapshots-serials prepare-build failed. Exit code: pid 131736 exit 4 (StandardError)
/var/lib/jenkins/workspace/test_Tails_ISO_21565-flatpak-safe/features/step_definitions/build.rb:103:in `/^I successfully run "?([[:alnum:] -]+)"?$/'
features/build.feature:194:in `When I successfully run "apt-snapshots-serials prepare-build"'
And I successfully run "apt-mirror debian" 0.000
Then I should see a time-based snapshot 0.000
When I successfully run "apt-mirror torproject" 0.000
Then I should see a time-based snapshot 0.000
When I successfully run "apt-mirror debian-security" 0.000
Then I should see a time-based snapshot 0.000
After features/support/hooks.rb:559 0.001
After features/support/hooks.rb:108 0.000
Tags: @source
2.742
Scenario build from a tagged testing branch with no encoded time-based snapshot
Before features/support/hooks.rb:274 0.000
Before features/support/hooks.rb:552 0.000
Steps
Given I am working on the testing base branch 0.031
And the last version mentioned in debian/changelog is 0.11 0.054
And Tails 0.11 has been released 0.018
And no frozen APT snapshot is encoded in config/APT_snapshots.d 0.000
And I checkout the 0.11 tag 0.002
When I successfully run "apt-snapshots-serials prepare-build" 2.635
apt-snapshots-serials prepare-build failed. Exit code: pid 131909 exit 4 (StandardError)
/var/lib/jenkins/workspace/test_Tails_ISO_21565-flatpak-safe/features/step_definitions/build.rb:103:in `/^I successfully run "?([[:alnum:] -]+)"?$/'
features/build.feature:226:in `When I successfully run "apt-snapshots-serials prepare-build"'
And I run "apt-mirror debian" 0.000
Then it should fail 0.000
When I run "apt-mirror torproject" 0.000
Then it should fail 0.000
When I successfully run "apt-mirror debian-security" 0.000
Then I should see the 0.11 tagged snapshot 0.000
After features/support/hooks.rb:559 0.001
After features/support/hooks.rb:108 0.000
Tags: @source
3.063
Scenario build from a tagged testing branch with encoded time-based snapshots
Before features/support/hooks.rb:274 0.000
Before features/support/hooks.rb:552 0.000
Steps
Given I am working on the testing base branch 0.025
And the last version mentioned in debian/changelog is 0.11 0.054
And Tails 0.11 has been released 0.017
And frozen APT snapshots are encoded in config/APT_snapshots.d 0.000
And I checkout the 0.11 tag 0.001
When I successfully run "apt-snapshots-serials prepare-build" 2.964
apt-snapshots-serials prepare-build failed. Exit code: pid 131955 exit 4 (StandardError)
/var/lib/jenkins/workspace/test_Tails_ISO_21565-flatpak-safe/features/step_definitions/build.rb:103:in `/^I successfully run "?([[:alnum:] -]+)"?$/'
features/build.feature:240:in `When I successfully run "apt-snapshots-serials prepare-build"'
And I successfully run "apt-mirror debian" 0.000
Then I should see the 0.11 tagged snapshot 0.000
When I successfully run "apt-mirror torproject" 0.000
Then I should see the 0.11 tagged snapshot 0.000
When I successfully run "apt-mirror debian-security" 0.000
Then I should see the 0.11 tagged snapshot 0.000
After features/support/hooks.rb:559 0.001
After features/support/hooks.rb:108 0.000
Tags: @source
2.679
Scenario build from a bugfix branch with no encoded time-based snapshot for a major release
Before features/support/hooks.rb:274 0.000
Before features/support/hooks.rb:552 0.000
Steps
Given I am working on the testing base branch 0.042
And Tails 0.10~rc1 has been released 0.024
And the last versions mentioned in debian/changelog are 0.10~rc1 and 0.10 0.078
And Tails 0.10 has not been released yet 0.000
And I am working on the bugfix/disable_gdomap branch based on testing 0.006
And no frozen APT snapshot is encoded in config/APT_snapshots.d 0.000
When I successfully run "apt-snapshots-serials prepare-build" 2.528
apt-snapshots-serials prepare-build failed. Exit code: pid 132135 exit 4 (StandardError)
/var/lib/jenkins/workspace/test_Tails_ISO_21565-flatpak-safe/features/step_definitions/build.rb:103:in `/^I successfully run "?([[:alnum:] -]+)"?$/'
features/build.feature:275:in `When I successfully run "apt-snapshots-serials prepare-build"'
And I run "apt-mirror debian" 0.000
Then it should fail 0.000
When I run "apt-mirror torproject" 0.000
Then it should fail 0.000
When I successfully run "apt-mirror debian-security" 0.000
Then I should see a time-based snapshot 0.000
After features/support/hooks.rb:559 0.001
After features/support/hooks.rb:108 0.000
Tags: @source
6.162
Scenario build from a bugfix branch with encoded time-based snapshots for a major release
Before features/support/hooks.rb:274 0.000
Before features/support/hooks.rb:552 0.000
Steps
Given I am working on the testing base branch 0.036
And Tails 0.10~rc1 has been released 0.035
And the last versions mentioned in debian/changelog are 0.10~rc1 and 0.10 0.088
And Tails 0.10 has not been released yet 0.000
And I am working on the bugfix/disable_gdomap branch based on testing 0.006
And frozen APT snapshots are encoded in config/APT_snapshots.d 0.000
When I successfully run "apt-snapshots-serials prepare-build" 5.996
apt-snapshots-serials prepare-build failed. Exit code: pid 132184 exit 4 (StandardError)
/var/lib/jenkins/workspace/test_Tails_ISO_21565-flatpak-safe/features/step_definitions/build.rb:103:in `/^I successfully run "?([[:alnum:] -]+)"?$/'
features/build.feature:290:in `When I successfully run "apt-snapshots-serials prepare-build"'
And I successfully run "apt-mirror debian" 0.000
Then I should see a time-based snapshot 0.000
When I successfully run "apt-mirror torproject" 0.000
Then I should see a time-based snapshot 0.000
When I successfully run "apt-mirror debian-security" 0.000
Then I should see a time-based snapshot 0.000
After features/support/hooks.rb:559 0.001
After features/support/hooks.rb:108 0.000
Tags: @source
2.913
Scenario build from the devel branch with no encoded time-based snapshot
Before features/support/hooks.rb:274 0.000
Before features/support/hooks.rb:552 0.000
Steps
Given I am working on the devel base branch 0.029
And no frozen APT snapshot is encoded in config/APT_snapshots.d 0.000
When I successfully run "apt-snapshots-serials prepare-build" 2.884
apt-snapshots-serials prepare-build failed. Exit code: pid 132303 exit 4 (StandardError)
/var/lib/jenkins/workspace/test_Tails_ISO_21565-flatpak-safe/features/step_definitions/build.rb:103:in `/^I successfully run "?([[:alnum:] -]+)"?$/'
features/build.feature:316:in `When I successfully run "apt-snapshots-serials prepare-build"'
And I successfully run "apt-mirror debian" 0.000
Then I should see a time-based snapshot 0.000
When I successfully run "apt-mirror torproject" 0.000
Then I should see a time-based snapshot 0.000
When I successfully run "apt-mirror debian-security" 0.000
Then I should see a time-based snapshot 0.000
After features/support/hooks.rb:559 0.000
After features/support/hooks.rb:108 0.000
Tags: @source
3.062
Scenario build from the devel branch with encoded time-based snapshots
Before features/support/hooks.rb:274 0.000
Before features/support/hooks.rb:552 0.000
Steps
Given I am working on the devel base branch 0.025
And frozen APT snapshots are encoded in config/APT_snapshots.d 0.000
When I successfully run "apt-snapshots-serials prepare-build" 3.037
apt-snapshots-serials prepare-build failed. Exit code: pid 132328 exit 4 (StandardError)
/var/lib/jenkins/workspace/test_Tails_ISO_21565-flatpak-safe/features/step_definitions/build.rb:103:in `/^I successfully run "?([[:alnum:] -]+)"?$/'
features/build.feature:327:in `When I successfully run "apt-snapshots-serials prepare-build"'
And I run "apt-mirror debian" 0.000
Then it should fail 0.000
When I run "apt-mirror torproject" 0.000
Then it should fail 0.000
When I successfully run "apt-mirror debian-security" 0.000
Then I should see a time-based snapshot 0.000
After features/support/hooks.rb:559 0.000
After features/support/hooks.rb:108 0.000
Tags: @source
2.763
Scenario build from a feature branch based on devel with no encoded time-based snapshot
Before features/support/hooks.rb:274 0.000
Before features/support/hooks.rb:552 0.000
Steps
Given I am working on the feature/thunderbird branch based on devel 0.037
And no frozen APT snapshot is encoded in config/APT_snapshots.d 0.000
When I successfully run "apt-snapshots-serials prepare-build" 2.725
apt-snapshots-serials prepare-build failed. Exit code: pid 132525 exit 4 (StandardError)
/var/lib/jenkins/workspace/test_Tails_ISO_21565-flatpak-safe/features/step_definitions/build.rb:103:in `/^I successfully run "?([[:alnum:] -]+)"?$/'
features/build.feature:366:in `When I successfully run "apt-snapshots-serials prepare-build"'
And I successfully run "apt-mirror debian" 0.000
Then I should see a time-based snapshot 0.000
When I successfully run "apt-mirror torproject" 0.000
Then I should see a time-based snapshot 0.000
When I successfully run "apt-mirror debian-security" 0.000
Then I should see a time-based snapshot 0.000
After features/support/hooks.rb:559 0.000
After features/support/hooks.rb:108 0.000
Tags: @source
3.062
Scenario build from a feature branch based on devel with encoded time-based snapshots
Before features/support/hooks.rb:274 0.000
Before features/support/hooks.rb:552 0.000
Steps
Given I am working on the feature/thunderbird branch based on devel 0.047
And frozen APT snapshots are encoded in config/APT_snapshots.d 0.000
When I successfully run "apt-snapshots-serials prepare-build" 3.014
apt-snapshots-serials prepare-build failed. Exit code: pid 132550 exit 4 (StandardError)
/var/lib/jenkins/workspace/test_Tails_ISO_21565-flatpak-safe/features/step_definitions/build.rb:103:in `/^I successfully run "?([[:alnum:] -]+)"?$/'
features/build.feature:377:in `When I successfully run "apt-snapshots-serials prepare-build"'
And I run "apt-mirror debian" 0.000
Then it should fail 0.000
When I run "apt-mirror torproject" 0.000
Then it should fail 0.000
When I successfully run "apt-mirror debian-security" 0.000
Then I should see a time-based snapshot 0.000
After features/support/hooks.rb:559 0.005
After features/support/hooks.rb:108 0.000
3:29.818
Scenario The Tails documentation launcher works when online
Before features/support/hooks.rb:274 0.000
Before features/support/hooks.rb:281 0.002
Steps
Given I have started Tails from DVD and logged in and the network is connected 10.240
When I start "Tails Documentation" via GNOME Activities Overview 9.423
Then the Tor Browser has started 10.146
And "Tails - Documentation" has loaded in the Tor Browser 3:0.008
try_for() timeout expired (Timeout::Error)
./features/support/helpers/misc_helpers.rb:145:in `rescue in try_for'
./features/support/helpers/misc_helpers.rb:51:in `try_for'
./features/step_definitions/browser.rb:263:in `page_has_loaded_in_the_tor_browser'
./features/step_definitions/browser.rb:278:in `/^"([^"]+)" has loaded in the Tor Browser$/'
features/documentation.feature:14:in `And "Tails - Documentation" has loaded in the Tor Browser'
After features/support/hooks.rb:339 5.433

SCENARIO FAILED: 'The Tails documentation launcher works when online' (at time 02:13:17)

Boot log: https://jenkins.tails.net/job/test_Tails_ISO_21565-flatpak-safe/47/artifact/build-artifacts/02:13:17_The_Tails_documentation_launcher_works_when_online.file_content_var_log_boot.log

Screenshot: https://jenkins.tails.net/job/test_Tails_ISO_21565-flatpak-safe/47/artifact/build-artifacts/02:13:17_The_Tails_documentation_launcher_works_when_online.png

Video: https://jenkins.tails.net/job/test_Tails_ISO_21565-flatpak-safe/47/artifact/build-artifacts/02:13:17_The_Tails_documentation_launcher_works_when_online.mkv

Systemd journal: https://jenkins.tails.net/job/test_Tails_ISO_21565-flatpak-safe/47/artifact/build-artifacts/02:13:17_The_Tails_documentation_launcher_works_when_online.journal

After features/support/hooks.rb:108 0.000
Tags: @product @doc
36.270
Scenario Anti test: Detecting TCP leaks from the Unsafe Browser with the firewall leak detector
Before features/support/hooks.rb:274 0.000
Before features/support/hooks.rb:281 0.007
Steps
Given I have started Tails from DVD and logged in and the network is connected 9.556
And I capture all network traffic 0.011
When I successfully start the Unsafe Browser 6.971
And I open the Tails homepage in the Unsafe Browser 6.657
And the Tails homepage loads in the Unsafe Browser 13.073
The
The Dogtail init script raised: SearchError: descendant of [application | Firefox]: child with name='Tails' roleName='document web'
STDOUT:

STDERR:

 (Dogtail::Failure)
./features/support/helpers/dogtail.rb:93:in `run'
./features/support/helpers/dogtail.rb:339:in `initialize'
./features/support/helpers/dogtail.rb:268:in `new'
./features/support/helpers/dogtail.rb:268:in `call_tree_api_method'
./features/support/helpers/dogtail.rb:276:in `child'
./features/step_definitions/browser.rb:379:in `headings_in_page'
./features/step_definitions/browser.rb:383:in `page_has_heading'
./features/step_definitions/unsafe_browser.rb:141:in `/^the Tails homepage loads in the Unsafe Browser$/'
features/tor_enforcement.feature:21:in `And the Tails homepage loads in the Unsafe Browser'
Then the firewall leak detector has detected leaks 0.000
After features/support/hooks.rb:339 5.371

SCENARIO FAILED: 'Anti test: Detecting TCP leaks from the Unsafe Browser with the firewall leak detector' (at time 03:47:44)

Boot log: https://jenkins.tails.net/job/test_Tails_ISO_21565-flatpak-safe/47/artifact/build-artifacts/03:47:44_Anti_test:_Detecting_TCP_leaks_from_the_Unsafe_Browser_with_the_firewall_leak_detector.file_content_var_log_boot.log

Screenshot: https://jenkins.tails.net/job/test_Tails_ISO_21565-flatpak-safe/47/artifact/build-artifacts/03:47:44_Anti_test:_Detecting_TCP_leaks_from_the_Unsafe_Browser_with_the_firewall_leak_detector.png

Video: https://jenkins.tails.net/job/test_Tails_ISO_21565-flatpak-safe/47/artifact/build-artifacts/03:47:44_Anti_test:_Detecting_TCP_leaks_from_the_Unsafe_Browser_with_the_firewall_leak_detector.mkv

Systemd journal: https://jenkins.tails.net/job/test_Tails_ISO_21565-flatpak-safe/47/artifact/build-artifacts/03:47:44_Anti_test:_Detecting_TCP_leaks_from_the_Unsafe_Browser_with_the_firewall_leak_detector.journal

After features/support/hooks.rb:108 0.049
41.922
Scenario Downloading files with the Tor Browser
Before features/support/hooks.rb:274 0.000
Before features/support/hooks.rb:281 0.003
Before features/support/hooks.rb:527 0.002
Steps
Given I have started Tails from DVD and logged in and the network is connected 9.744
When I start the Tor Browser 7.172
When I download some file in the Tor Browser to the Downloads directory 25.005
The
The Dogtail init script raised: SearchError: descendant of [application | Firefox]: child with name='Opening tails-signing.key'
STDOUT:

STDERR:

 (Dogtail::Failure)
./features/support/helpers/dogtail.rb:93:in `run'
./features/support/helpers/dogtail.rb:339:in `initialize'
./features/support/helpers/dogtail.rb:268:in `new'
./features/support/helpers/dogtail.rb:268:in `call_tree_api_method'
./features/support/helpers/dogtail.rb:276:in `child'
./features/step_definitions/browser.rb:356:in `/^I download some file in the Tor Browser to the (.*) directory$/'
features/torified_browsing.feature:29:in `When I download some file in the Tor Browser to the Downloads directory'
Then the file is saved to the Downloads directory 0.000
After features/support/hooks.rb:535 0.035
After features/support/hooks.rb:339 5.180

SCENARIO FAILED: 'Downloading files with the Tor Browser' (at time 03:52:52)

Boot log: https://jenkins.tails.net/job/test_Tails_ISO_21565-flatpak-safe/47/artifact/build-artifacts/03:52:52_Downloading_files_with_the_Tor_Browser.file_content_var_log_boot.log

Screenshot: https://jenkins.tails.net/job/test_Tails_ISO_21565-flatpak-safe/47/artifact/build-artifacts/03:52:52_Downloading_files_with_the_Tor_Browser.png

Video: https://jenkins.tails.net/job/test_Tails_ISO_21565-flatpak-safe/47/artifact/build-artifacts/03:52:52_Downloading_files_with_the_Tor_Browser.mkv

Systemd journal: https://jenkins.tails.net/job/test_Tails_ISO_21565-flatpak-safe/47/artifact/build-artifacts/03:52:52_Downloading_files_with_the_Tor_Browser.journal

After features/support/hooks.rb:108 0.000
4:26.738
Scenario Cloning git repository over SSH
Steps
Given I have the SSH key pair for a Git repository 0.192
When I clone the Git repository "ssh://gitolite3@git.tails.net:3004/myprivatekeyispublic/testing.git" in Console 4:16.545
Then the Git repository "testing" has been cloned successfully 10.000
the
the Git repository has not been cloned (Timeout::Error)
./features/support/helpers/misc_helpers.rb:145:in `rescue in try_for'
./features/support/helpers/misc_helpers.rb:51:in `try_for'
./features/step_definitions/git.rb:29:in `/^the Git repository "(\S+)" has been cloned successfully$/'
features/torified_git.feature:17:in `Then the Git repository "testing" has been cloned successfully'
After features/support/hooks.rb:535 0.044
After features/support/hooks.rb:339 4.900

SCENARIO FAILED: 'Cloning git repository over SSH' (at time 04:08:22)

Boot log: https://jenkins.tails.net/job/test_Tails_ISO_21565-flatpak-safe/47/artifact/build-artifacts/04:08:22_Cloning_git_repository_over_SSH.file_content_var_log_boot.log

Screenshot: https://jenkins.tails.net/job/test_Tails_ISO_21565-flatpak-safe/47/artifact/build-artifacts/04:08:22_Cloning_git_repository_over_SSH.png

Video: https://jenkins.tails.net/job/test_Tails_ISO_21565-flatpak-safe/47/artifact/build-artifacts/04:08:22_Cloning_git_repository_over_SSH.mkv

Systemd journal: https://jenkins.tails.net/job/test_Tails_ISO_21565-flatpak-safe/47/artifact/build-artifacts/04:08:22_Cloning_git_repository_over_SSH.journal

After features/support/hooks.rb:108 0.000
Tags: @product @doc
35.636
Scenario The Unsafe Browser can load a web page from the Internet
Before features/support/hooks.rb:274 0.000
Before features/support/hooks.rb:281 0.003
Steps
Given I have started Tails from DVD and logged in and the network is connected 9.889
When I successfully start the Unsafe Browser 6.469
When I open the Tails homepage in the Unsafe Browser 6.686
Then the Tails homepage loads in the Unsafe Browser 12.590
The
The Dogtail init script raised: SearchError: descendant of [application | Firefox]: child with name='Tails' roleName='document web'
STDOUT:

STDERR:

 (Dogtail::Failure)
./features/support/helpers/dogtail.rb:93:in `run'
./features/support/helpers/dogtail.rb:339:in `initialize'
./features/support/helpers/dogtail.rb:268:in `new'
./features/support/helpers/dogtail.rb:268:in `call_tree_api_method'
./features/support/helpers/dogtail.rb:276:in `child'
./features/step_definitions/browser.rb:379:in `headings_in_page'
./features/step_definitions/browser.rb:383:in `page_has_heading'
./features/step_definitions/unsafe_browser.rb:141:in `/^the Tails homepage loads in the Unsafe Browser$/'
features/unsafe_browser.feature:39:in `Then the Tails homepage loads in the Unsafe Browser'
And the Unsafe Browser has sent packets out to the Internet 0.000
After features/support/hooks.rb:339 5.004

SCENARIO FAILED: 'The Unsafe Browser can load a web page from the Internet' (at time 04:12:29)

Boot log: https://jenkins.tails.net/job/test_Tails_ISO_21565-flatpak-safe/47/artifact/build-artifacts/04:12:29_The_Unsafe_Browser_can_load_a_web_page_from_the_Internet.file_content_var_log_boot.log

Screenshot: https://jenkins.tails.net/job/test_Tails_ISO_21565-flatpak-safe/47/artifact/build-artifacts/04:12:29_The_Unsafe_Browser_can_load_a_web_page_from_the_Internet.png

Video: https://jenkins.tails.net/job/test_Tails_ISO_21565-flatpak-safe/47/artifact/build-artifacts/04:12:29_The_Unsafe_Browser_can_load_a_web_page_from_the_Internet.mkv

Systemd journal: https://jenkins.tails.net/job/test_Tails_ISO_21565-flatpak-safe/47/artifact/build-artifacts/04:12:29_The_Unsafe_Browser_can_load_a_web_page_from_the_Internet.journal

After features/support/hooks.rb:108 0.000